Germanium, bis[bis(trimethylsilyl)]amino-

Gas phase ion energetics data

Data compiled by: Sharon G. Lias, Rhoda D. Levin, and Sherif A. Kafafi

Ionization energy determinations

IE (eV) Method Reference Comment
7.71 ± 0.05PEHarris, Lappert, et al., 1976Vertical value
7.72PEHarris and Lappert, 1974Vertical value

References

Harris, Lappert, et al., 1976
Harris, D.H.; Lappert, M.F.; Pedley, J.B.; Sharp, G.J., Bonding studies of compounds of group 3-5 elements. Part XVIII. He(I) photoelectron spectra of bivalent homoleptic alkyls and amides, especially of group 4 elements, and of tin(II) chloride and bromide, J. Chem. Soc. Dalton Trans., 1976, 945. [all data]

Harris and Lappert, 1974
Harris, D.H.; Lappert, M.F., Monomeric, volatile bilvalent amides of Group IVB elements, M(NR12)2 and M(NR1R2)2 (M=Ge, Sn, or Pb; R1=Me3Si, R2=Me3C), J. Chem. Soc., Chem. Commun., 1974, 895. [all data]