Benzenamine, N-methyl-N-phenyl-

Condensed phase thermochemistry data

Data compiled as indicated in comments:
ALS - Hussein Y. Afeefy, Joel F. Liebman, and Stephen E. Stein
DH - Eugene S. Domalski and Elizabeth D. Hearing

Quantity Value Units Method Reference Comment
Δfliquid120.5 ± 7.1kJ/molCcbTavernier and Lamouroux, 1956Reanalyzed by Cox and Pilcher, 1970, Original value = 132.8 kJ/mol; Author's hf298_condensed=25.417 kcal/mol; ALS
Quantity Value Units Method Reference Comment
Δcliquid-7094.0 ± 7.1kJ/molCcbTavernier and Lamouroux, 1956Reanalyzed by Cox and Pilcher, 1970, Original value = -7106.323 kJ/mol; Author's hf298_condensed=25.417 kcal/mol; ALS

Constant pressure heat capacity of liquid

Cp,liquid (J/mol*K) Temperature (K) Reference Comment
301.2298.von Reis, 1881T = 293 to 467 K.; DH

Phase change data

Data compiled as indicated in comments:
TRC - Thermodynamics Research Center, NIST Boulder Laboratories, Chris Muzny director
AC - William E. Acree, Jr., James S. Chickos

Quantity Value Units Method Reference Comment
Tboil566.55KN/ATimmermans, 1921Uncertainty assigned by TRC = 0.3 K; TRC
Tboil569.15KN/APerkin, 1896Uncertainty assigned by TRC = 1. K; TRC
Quantity Value Units Method Reference Comment
Tfus263.55KN/ABramley, 1916Uncertainty assigned by TRC = 0.2 K; TRC

Enthalpy of vaporization

ΔvapH (kJ/mol) Temperature (K) Method Reference Comment
65.2391.AStephenson and Malanowski, 1987Based on data from 376. - 555. K. See also Stull, 1947.; AC

Antoine Equation Parameters

log10(P) = A − (B / (T + C))
    P = vapor pressure (bar)
    T = temperature (K)

View plot Requires a JavaScript / HTML 5 canvas capable browser.

Temperature (K) A B C Reference Comment
376.7 - 555.5.468122828.886-37.44Stull, 1947Coefficents calculated by NIST from author's data.

In addition to the Thermodynamics Research Center (TRC) data available from this site, much more physical and chemical property data is available from the following TRC products:

Gas phase ion energetics data

Data compiled by: Sharon G. Lias, Rhoda D. Levin, and Sherif A. Kafafi

Ionization energy determinations

IE (eV) Method Reference Comment
6.94 ± 0.03PIPotapov, Kardash, et al., 1972
7.33PEHaink, Adams, et al., 1974Vertical value

References

Tavernier and Lamouroux, 1956
Tavernier, P.; Lamouroux, M., Determinations calorimetriques relatives a vingt-six substances organiques, Mem. Poudres, 1956, 38, 65-88. [all data]

Cox and Pilcher, 1970
Cox, J.D.; Pilcher, G., Thermochemistry of Organic and Organometallic Compounds, Academic Press, New York, 1970, 1-636. [all data]

von Reis, 1881
von Reis, M.A., Die specifische Wärme flüssiger organischer Verbindungen und ihre Beziehung zu deren Moleculargewicht, Ann. Physik [3], 1881, 13, 447-464. [all data]

Timmermans, 1921
Timmermans, J., The Freezing Points of Organic Substances IV. New Exp. Determinations, Bull. Soc. Chim. Belg., 1921, 30, 62. [all data]

Perkin, 1896
Perkin, W.H., LXIX. On Magnetic Rotatory Power, especially of Aromatic Compounds, J. Chem. Soc., 1896, 69, 1025-1257. [all data]

Bramley, 1916
Bramley, A., The Studyu of Binary Mixtures. Part III. Freezing Point Curves, J. Chem. Soc., 1916, 109, 469. [all data]

Stephenson and Malanowski, 1987
Stephenson, Richard M.; Malanowski, Stanislaw, Handbook of the Thermodynamics of Organic Compounds, 1987, https://doi.org/10.1007/978-94-009-3173-2 . [all data]

Stull, 1947
Stull, Daniel R., Vapor Pressure of Pure Substances. Organic and Inorganic Compounds, Ind. Eng. Chem., 1947, 39, 4, 517-540, https://doi.org/10.1021/ie50448a022 . [all data]

Potapov, Kardash, et al., 1972
Potapov, V.K.; Kardash, I.E.; Sorokin, V.V.; Sokolov, S.A.; Evlasheva, T.I., Photoionization of heteroaromatic compounds, Khim. Vys. Energ., 1972, 6, 392. [all data]

Haink, Adams, et al., 1974
Haink, H.J.; Adams, J.E.; Huber, J.R., The electronic structure of aromatic amines: photoelectron spectroscopy of diphenylamine, iminobibenzyl, acridan and carbazole, Ber. Bunsen-Ges. Phys. Chem., 1974, 78, 436. [all data]

Kampel, et al., 1975
Kampel, L.P., et al., Zhur. Obshei Khim., 1975, 45, 2734. [all data]