Methylephedrine

Van Den Dool and Kratz RI, non-polar column, temperature ramp

Data compiled by: NIST Mass Spectrometry Data Center, William E. Wallace, director

Column type CapillaryCapillary
Active phase VF-5MSCBP-1
Column length (m) 30.12.
Carrier gas HeN2
Substrate
Column diameter (mm) 0.250.53
Phase thickness (μm) 0.25
Tstart (C) 60.120.
Tend (C) 270.250.
Heat rate (K/min)  6.
Initial hold (min)
Final hold (min)
I 1430.61363.
ReferenceTretyakov, 2014Oyama, Sano, et al., 1987
Comment MSDC-RI MSDC-RI

References

Tretyakov, 2014
Tretyakov, K.V., Retention Data. NIST Mass Spectrometry Data Center., NIST Mass Spectrometry Data Center, 2014. [all data]

Oyama, Sano, et al., 1987
Oyama, N.; Sano, T.; Syoyama, M.; Maeda, K., Studies on systematic analysis of poisonous compounds in forensic chemistry. II. Application of capillary column gas chromatography to substance identification by means of retention indices, Eisei Kagaku, 1987, 33, 5, 342-348, https://doi.org/10.1248/jhs1956.33.342 . [all data]