Praziquantel

Phase change data

Data compiled by: William E. Acree, Jr., James S. Chickos

Enthalpy of fusion

ΔfusH (kJ/mol) Temperature (K) Reference
30.8412.2El-Arini, Giron, et al., 1998

References

El-Arini, Giron, et al., 1998
El-Arini, Silvia Kocova; Giron, Daniele; Leuenberger, Hans, Solubility Properties of Racemic Praziquantel and Its Enantiomers, Pharmaceutical Development and Technology, 1998, 3, 4, 557-564, https://doi.org/10.3109/10837459809028638 . [all data]