β-Alanine, 3TMS derivative

Van Den Dool and Kratz RI, non-polar column, custom temperature program

View large format table.

Column type Active phase I Reference Comment
CapillaryPolydimethyl siloxane with 5 % phenyl groups1427.Kempa, Hummel, et al., 2009Program: not specified
CapillaryMethyl Silicone1434.Peng, Yang, et al., 1991Program: not specified

Normal alkane RI, non-polar column, custom temperature program

View large format table.

Column type Active phase I Reference Comment
CapillaryPolydimethyl siloxane1423.Supplemental Table S3, 2012Program: not specified
CapillaryMethylsiloxane, 5 % Ph groups1439.Cao, Aa, et al., 2011Program: not specified

References

Kempa, Hummel, et al., 2009
Kempa, S.; Hummel, J.; Schwemmer, T.; Pietzke, M.; Strehmel, N.; Wienkoop, S.; Kopka, J.; Weckwerth, W., An automated GCxGC-TOF-MS protocol for batch-wise extraction and alinmebt of mass isotopomer matrixes from differential 13C-labeling experiments: a case study for photoautotrophic-mixotrophic grown Chlamydomonas reinhardtii cells, J. Basic Microbiol., 2009, 49, 1, 82-91, https://doi.org/10.1002/jobm.200800337 . [all data]

Peng, Yang, et al., 1991
Peng, C.T.; Yang, Z.C.; Maltby, D., Prediction of retention indexes. III. Silylated derivatives of polar compounds, J. Chromatogr., 1991, 586, 1, 113-129, https://doi.org/10.1016/0021-9673(91)80029-G . [all data]

Supplemental Table S3, 2012
Supplemental Table S3, Manually identified analytes present in all three independent not-lethal salt stress acclimation experiments, 2012, retrieved from www.plosone.org/article/fetchSingleRepresentation.action?uri. [all data]

Cao, Aa, et al., 2011
Cao, B.; Aa, J.; Wang, G.; Wu, X.; Liu, L.; Li, M.; Shi, J.; Wang, X.; Zhao, C.; Zheng, T.; Guo, S.; Duan, J., GC-TOFMS analysis of metabolites in adherent MDCK cells and a movel strategy for identifying intracellular metabolic markers for use as cell amount indicators in data normalization, Anal. Bioanal. Chem., 2011, 400, 9, 2983-2993, https://doi.org/10.1007/s00216-011-4981-8 . [all data]