Naphthalene, 1,2,3,4-tetrahydro-5,8-dimethyl-1-octyl-

Phase change data

Data compiled by: William E. Acree, Jr., James S. Chickos

Enthalpy of vaporization

ΔvapH (kJ/mol) Temperature (K) Reference Comment
78.6434.Dixon, Yarnell, et al., 1963Based on data from 419. - 481. K. See also Boublik, Fried, et al., 1984 and Dykyj, Svoboda, et al., 1999.

References

Dixon, Yarnell, et al., 1963
Dixon, Joseph A.; Yarnell, G.R.; Mountain, J.A., Physical Properties of Twelve Isomeric Alkyl-Substituted Naphthalenes, Tetrahydronaphthalenes, and Decahydronaphthalenes., J. Chem. Eng. Data, 1963, 8, 4, 572-573, https://doi.org/10.1021/je60019a030 . [all data]

Boublik, Fried, et al., 1984
Boublik, T.; Fried, V.; Hala, E., The Vapour Pressures of Pure Substances: Selected Values of the Temperature Dependence of the Vapour Pressures of Some Pure Substances in the Normal and Low Pressure Region, 2nd ed., Elsevier, New York, 1984, 972. [all data]

Dykyj, Svoboda, et al., 1999
Dykyj, J.; Svoboda, J.; Wilhoit, R.C.; Frenkel, M.L.; Hall, K.R., Vapor Pressure of Chemicals: Part A. Vapor Pressure and Antoine Constants for Hydrocarbons and Sulfur, Selenium, Tellurium and Hydrogen Containing Organic Compounds, Springer, Berlin, 1999, 373. [all data]