Benzene, 1-(chloromethyl)-2-methyl-

Normal alkane RI, non-polar column, custom temperature program

Data compiled by: NIST Mass Spectrometry Data Center, William E. Wallace, director

Column type Capillary
Active phase Methyl Silicone
Column length (m)
Carrier gas
Substrate
Column diameter (mm)
Phase thickness (μm)
Program not specified
I 1105.
ReferenceZenkevich, 1999
Comment MSDC-RI

References

Zenkevich, 1999
Zenkevich, I.G., Mutual Correlation between Gas-Chromatographic Retention Indices of Organic Compounds from Different Series, Zh. Anal. Khim., 1999, 54, 12, 1272-1279. [all data]