Acetamide, N-(2-nitrophenyl)-

Phase change data

Data compiled as indicated in comments:
TRC - Thermodynamics Research Center, NIST Boulder Laboratories, Chris Muzny director
AC - William E. Acree, Jr., James S. Chickos

Quantity Value Units Method Reference Comment
Tfus366.2KN/ASidgwick and Rubie, 1921Uncertainty assigned by TRC = 0.5 K; TRC

Enthalpy of vaporization

ΔvapH (kJ/mol) Temperature (K) Method Reference Comment
44.0488.AStephenson and Malanowski, 1987Based on data from 473. - 593. K.; AC

In addition to the Thermodynamics Research Center (TRC) data available from this site, much more physical and chemical property data is available from the following TRC products:

Gas phase ion energetics data

Data compiled by: Sharon G. Lias, Rhoda D. Levin, and Sherif A. Kafafi

Ionization energy determinations

IE (eV) Method Reference
8.85EIBaldwin, Loudon, et al., 1976

References

Sidgwick and Rubie, 1921
Sidgwick, N.V.; Rubie, H.E., The solubility and volatility of the chloro- and nitro-anilines and of their acetyl derivatives, J. Chem. Soc., 1921, 119, 1013-24. [all data]

Stephenson and Malanowski, 1987
Stephenson, Richard M.; Malanowski, Stanislaw, Handbook of the Thermodynamics of Organic Compounds, 1987, https://doi.org/10.1007/978-94-009-3173-2 . [all data]