IF5+

Vibrational and/or electronic energy levels

Data compiled by: Marilyn E. Jacox

State:   I,J

 Energy
 (cm-1
 Med.   Transition   λmin
 (nm)
 λmax
 (nm)

References

To = 47520 ± 650 gas DeKock, Higginson, et al., 1972

State:   G,H

 Energy
 (cm-1
 Med.   Transition   λmin
 (nm)
 λmax
 (nm)

To = 31870 ± 560 gas DeKock, Higginson, et al., 1972

State:   E,F

 Energy
 (cm-1
 Med.   Transition   λmin
 (nm)
 λmax
 (nm)

Tx = 26460 ± 320 gas DeKock, Higginson, et al., 1972

State:   C,D

 Energy
 (cm-1
 Med.   Transition   λmin
 (nm)
 λmax
 (nm)

Tx = 24040 ± 400 gas DeKock, Higginson, et al., 1972

State:   A,B

 Energy
 (cm-1
 Med.   Transition   λmin
 (nm)
 λmax
 (nm)

To = 14200 ± 500 gas DeKock, Higginson, et al., 1972

Additional references: Jacox, 1994, page 358

DeKock, Higginson, et al., 1972
DeKock, R.L.; Higginson, B.R.; Lloyd, D.R., Photoelectron spectra of halides. Part 6.--The spectra of SF5Cl, BrF5 and IF5, Faraday Discuss. Chem. Soc., 1972, 54, 84. [all data]

Jacox, 1994
Jacox, M.E., Vibrational and electronic energy levels of polyatomic transient molecules, American Chemical Society, Washington, DC, 1994, 464. [all data]