2-Propanol, 2,2'-azobis-, diacetate (ester), (E)-

Gas phase ion energetics data

Data compiled by: Sharon G. Lias, Rhoda D. Levin, and Sherif A. Kafafi

Ionization energy determinations

IE (eV) Method Reference Comment
8.74PEHouk, Chang, et al., 1975Vertical value

References

Houk, Chang, et al., 1975
Houk, K.N.; Chang, Y.-M.; Engel, P.S., Photoelectron spectroscopy of azo compounds, J. Am. Chem. Soc., 1975, 97, 1824. [all data]