1H-Cycloprop[e]azulen-4-ol, decahydro-1,1,4,7-tetramethyl-, [1aR-(1aα,4β,4aβ,7α,7aβ,7bα)]-

Kovats' RI, polar column, custom temperature program

Data compiled by: NIST Mass Spectrometry Data Center, William E. Wallace, director

Column type Capillary
Active phase HP-Innowax
Column length (m) 30.
Carrier gas H2
Substrate
Column diameter (mm) 0.32
Phase thickness (μm) 0.50
Program 60 0C (8 min) 3 K/min -> 180 0C 20 K/min -> 230 0C (20 min)
I 2100.
ReferenceFrizzo, Serafini, et al., 2001
Comment MSDC-RI

Normal alkane RI, non-polar column, temperature ramp

Data compiled by: NIST Mass Spectrometry Data Center, William E. Wallace, director

Column type CapillaryCapillaryCapillaryCapillaryCapillary
Active phase DB-5HP-1RTX-1HP-5HP-5
Column length (m) 30.30.60.25.25.
Carrier gas HeliumHeliumHeliumHydrogenHydrogen
Substrate
Column diameter (mm) 0.250.250.220.320.32
Phase thickness (μm) 0.250.250.250.520.52
Tstart (C) 60.60.60.40.40.
Tend (C) 240.240.230.280.280.
Heat rate (K/min) 3.3.2.4.4.
Initial hold (min)
Final hold (min)   5.10.10.
I 1590.1590.1590.1586.1586.
ReferenceRodriques, Amorim, et al., 2013Alizadeh and Shaabani, 2012Bendiabdellah, El Amine Dib, et al., 2012Velickovic, Ristic, et al., 2012Velickovic, Ristic, et al., 2012
Comment MSDC-RI MSDC-RI MSDC-RI MSDC-RI MSDC-RI
Column type CapillaryCapillaryCapillaryCapillaryCapillary
Active phase HP-5HP-5 MSCP-Sil 5 CBHP-5 MSDB-5
Column length (m) 25.30.25.30.30.
Carrier gas HydrogenHeliumHeliumHeliumHelium
Substrate
Column diameter (mm) 0.320.250.250.250.25
Phase thickness (μm) 0.520.250.150.250.25
Tstart (C) 40.50.50.50.60.
Tend (C) 280.250.220.180.240.
Heat rate (K/min) 4.7. 2.3.
Initial hold (min)  1.
Final hold (min) 10.5.
I 1586.1593.1589.1588.1590.
ReferenceVelickovic, Ristic, et al., 2012Zouari, Ayadi, et al., 2012Ameen, Usman, et al., 2011Hammami, Kamoun, et al., 2011Karimi, Farmani, et al., 2011
Comment MSDC-RI MSDC-RI MSDC-RI MSDC-RI MSDC-RI
Column type CapillaryCapillaryCapillaryCapillaryCapillary
Active phase HP-5SPB-1HP-5HP-5 MSHP-5 MS
Column length (m) 30.30.30.30.30.
Carrier gas HeliumHeliumHeliumHeliumHelium
Substrate
Column diameter (mm) 0.320.250.250.250.25
Phase thickness (μm) 0.250.250.250.250.25
Tstart (C) 60.50.50.70.60.
Tend (C) 240.250.240.290.220.
Heat rate (K/min) 3.5.3.5.6.
Initial hold (min) 2.3.5. 3.
Final hold (min)  15. 10.
I 1590.1583.1592.1601.1588.
ReferenceKahriman, Tosun, et al., 2010Lazarevic, Palic, et al., 2010Monsef-Esfahani, Miri, et al., 2010Radulovic, Blagojevic, et al., 2010Safaei-Ghomi and Batooli, 2010
Comment MSDC-RI MSDC-RI MSDC-RI MSDC-RI MSDC-RI
Column type CapillaryCapillaryCapillaryCapillaryCapillary
Active phase DB-5 MSDB-5HP-5MSRTX-1RTX-1
Column length (m) 30.30.30.60.60.
Carrier gas HeliumHeliumHeliumHeliumHelium
Substrate
Column diameter (mm) 0.250.250.250.220.22
Phase thickness (μm) 0.250.250.250.250.25
Tstart (C) 60.40.50.60.60.
Tend (C) 240.240.250.230.230.
Heat rate (K/min) 3.3.7.2.2.
Initial hold (min)  1.1.
Final hold (min)   5.30.30.
I 1593.1569.1608.1580.1592.
ReferenceSilva, Pott, et al., 2010de Souza, Lopes, et al., 2010Zouari, Zouari, et al., 2010Museli, Pau, et al., 2009Museli, Pau, et al., 2009
Comment MSDC-RI MSDC-RI MSDC-RI MSDC-RI MSDC-RI
Column type CapillaryCapillaryCapillaryCapillaryCapillary
Active phase 5 % Phenyl methyl siloxaneDB-5DB-5HP-5HP-5
Column length (m) 60.30.30.30.30.
Carrier gas HeliumNitrogenHeliumNitrogenHelium
Substrate
Column diameter (mm) 0.250.250.250.250.32
Phase thickness (μm) 0.250.250.250.250.25
Tstart (C) 90.40.40.50.100.
Tend (C) 225.230.240.280.240.
Heat rate (K/min) 3.2.3.5.5.
Initial hold (min)   1.1.2.
Final hold (min) 3.  1.5.
I 1592.1593.1569.1587.1590.
ReferenceRetta, Gattuso, et al., 2009Scrivanti, Anton, et al., 2009de Souza, Lopes, et al., 2009Bousaada, Ammar, et al., 2008Lago, Romoff, et al., 2008
Comment MSDC-RI MSDC-RI MSDC-RI MSDC-RI MSDC-RI
Column type CapillaryCapillaryCapillaryCapillaryCapillary
Active phase ZB-1DB-5 MSRTX-1BPX-5HP-5
Column length (m) 30.30.60.7.525.
Carrier gas NitrogenHeliumHeHeliumHelium
Substrate
Column diameter (mm) 0.250.250.220.100.25
Phase thickness (μm) 0.250.250.2510.0.25
Tstart (C) 45.50.60.60.60.
Tend (C) 230.300.230.240.240.
Heat rate (K/min) 3.5.2.3.4.
Initial hold (min)  5.  2.
Final hold (min)  5.35.
I 1578.1598.1580.1597.1590.
ReferenceMierendorff, Stahl-Biskup, et al., 2008Noudogbessi, Yedomonhan, et al., 2008Paolini, Tomi, et al., 2008Shellie, 2008Verdian-rizi, 2008
Comment MSDC-RI MSDC-RI MSDC-RI MSDC-RI MSDC-RI
Column type CapillaryCapillaryCapillaryCapillaryCapillary
Active phase HP-5DB-5HP-5MSDB-5DB-5
Column length (m) 30.30.30.30.30.
Carrier gas HeliumHeHeHeliumHe
Substrate
Column diameter (mm) 0.250.260.250.260.25
Phase thickness (μm) 0.320.250.250.250.25
Tstart (C) 60.60.60.60.35.
Tend (C) 250.240.280.290.220.
Heat rate (K/min) 5.3.3.3.3.
Initial hold (min) 30.
Final hold (min)     40.
I 1589.1591.1593.1591.1590.
ReferenceYassa and Akhani, 2008Bos, Woerdenbag, et al., 2007Bozin B., Mlmica-Dukic N., et al., 2007Elfami, Bos, et al., 2007El-Ghorab A., El-Massry K.F., et al., 2007
Comment MSDC-RI MSDC-RI MSDC-RI MSDC-RI MSDC-RI
Column type CapillaryCapillaryCapillaryCapillaryCapillary
Active phase Col-Elite 5MSHP-1HP-5 MSSPB-1SPB-5
Column length (m) 30.30.25.30.30.
Carrier gas HeHeHeliumHeHe
Substrate
Column diameter (mm) 0.250.250.250.20.25
Phase thickness (μm) 0.250.250.250.20.25
Tstart (C) 30.60.100.70.50.
Tend (C) 246.240.280.220.250.
Heat rate (K/min) 3.2.4.3.2.
Initial hold (min)   3.
Final hold (min)  20.5.15.
I 1628.1590.1594.1572.1600.
ReferenceGudaityte and Venskutonis R.P., 2007Hachicha, Skanji, et al., 2007Phutdhawong, Kawaree, et al., 2007Pinto, Salgueiro, et al., 2007Raal, Orav, et al., 2007
Comment MSDC-RI MSDC-RI MSDC-RI MSDC-RI MSDC-RI
Column type CapillaryCapillaryCapillaryCapillaryCapillary
Active phase DB-5HP-5 MSHP-5HP-5MSZB-5
Column length (m) 30.30.30.30.30.
Carrier gas  HeliumHeHe
Substrate
Column diameter (mm) 0.250.250.250.250.25
Phase thickness (μm) 0.250.250.320.250.25
Tstart (C) 40.60.60.40.40.
Tend (C) 250.280.250.260.300.
Heat rate (K/min) 2.3.5.4.2.
Initial hold (min)   30.
Final hold (min) 33.
I 1585.1592.1589.1597.21569.
ReferenceSylvestre, Pichette, et al., 2007Tsokou, Georgopoulos, et al., 2007Yassa and Akhani, 2007Zizovic, Stamenic, et al., 2007Biondi, Sari, et al., 2006
Comment MSDC-RI MSDC-RI MSDC-RI MSDC-RI MSDC-RI
Column type CapillaryCapillaryCapillaryCapillaryCapillary
Active phase AT-5HP-5MSDB-1DB-5HP-1
Column length (m) 60.30.60.30.50.
Carrier gas HeHeNitrogenHeliumHe
Substrate
Column diameter (mm) 0.250.250.250.260.2
Phase thickness (μm) 0.250.25 0.250.33
Tstart (C) 60.60.40.60.60.
Tend (C) 200.280.200.290.250.
Heat rate (K/min) 4.3.2.3.2.
Initial hold (min)   1.
Final hold (min) 20. 9. 40.
I 1594.1591.1582.1591.1576.
ReferenceBorges, Rojas, et al., 2006Bozin, Mimicá-Dukic, et al., 2006Chen, Sheu, et al., 2006Elfami, Komar, et al., 2006Filippi, Lanfranchi, et al., 2006
Comment MSDC-RI MSDC-RI MSDC-RI MSDC-RI MSDC-RI
Column type CapillaryCapillaryCapillaryCapillaryCapillary
Active phase HP-5DB-1DB-5DB-5DB-5
Column length (m) 30.60.30.30.30.
Carrier gas Helium HeHeHe
Substrate
Column diameter (mm) 0.320.250.250.250.25
Phase thickness (μm) 0.250.250.250.250.25
Tstart (C) 60.70.60.60.50.
Tend (C) 260.230.220.220.250.
Heat rate (K/min) 5.2.4.4.4.
Initial hold (min) 2.2. 5.
Final hold (min) 13.20.
I 1594.1636.1596.1595.1598.
ReferenceKucuk, Gulec, et al., 2006Lan Phi N.T., Nishiyama C., et al., 2006Morteza-Semnani, Akbarzadeh, et al., 2006Morteza-Semnani K., Saeedi M., et al., 2006Najafpour Navaei, Mirza, et al., 2006
Comment MSDC-RI MSDC-RI MSDC-RI MSDC-RI MSDC-RI
Column type CapillaryCapillaryCapillaryCapillaryCapillary
Active phase NB-30HP-5DB-5HP-5MSHP-5
Column length (m) 30.30.30.30.25.
Carrier gas HeHeHydrogenHeH2
Substrate
Column diameter (mm) 0.20.250.250.250.32
Phase thickness (μm) 0.250.250.250.250.25
Tstart (C) 50.60.70.60.60.
Tend (C) 250.220.280.280.240.
Heat rate (K/min) 2.5.4.3.3.
Initial hold (min)  10.4.
Final hold (min)
I 1581.1589.1590.1560.1597.
ReferenceOrav, Raal, et al., 2006Pintore G., Chessa M., et al., 2006Pino, Marbot, et al., 2006Pitarokili, Tzakou, et al., 2006Potzernheim, Bizzo, et al., 2006
Comment MSDC-RI MSDC-RI MSDC-RI MSDC-RI MSDC-RI
Column type CapillaryCapillaryCapillaryCapillaryCapillary
Active phase HP-5MSSPB-5DB-5SPB-1HP-5
Column length (m) 30. 30.50.25.
Carrier gas  HeN2HeHe
Substrate
Column diameter (mm) 0.25 0.250.20.2
Phase thickness (μm) 0.25 0.250.330.33
Tstart (C) 50.50.60.50.60.
Tend (C) 250.250.240.220.240.
Heat rate (K/min) 10.5.4.4.3.
Initial hold (min) 5.3. 1.
Final hold (min)  15. 10.7.
I 1607.1590.1598.1575.1589.
ReferenceRobinson, 2006Stojanovic, Palic, et al., 2006Trilles, Bombarda, et al., 2006Wong, Lim, et al., 2006Duarte, Figueira, et al., 2005
Comment MSDC-RI MSDC-RI MSDC-RI MSDC-RI MSDC-RI
Column type CapillaryCapillaryCapillaryCapillaryCapillary
Active phase CP Sil 8 CBHP-5DB-1DB-5DB-1
Column length (m) 30.30.30.30.50.
Carrier gas HeHeHeHeN2
Substrate
Column diameter (mm) 0.250.250.250.320.25
Phase thickness (μm) 0.250.250.25 0.25
Tstart (C) 80.60.50.60.95.
Tend (C) 200.30.265.240.240.
Heat rate (K/min) 3.4.2.53.4.
Initial hold (min) 5.3.1.
Final hold (min) 5.15.20.
I 1586.1593.1575.1594.1590.
ReferenceFacey, Porter, et al., 2005Ferretti, Maggi, et al., 2005Khanavi, Ghasemian, et al., 2005Khayyat and Karimi, 2005Pala-Paul, Perez-Alonso, et al., 2005
Comment MSDC-RI MSDC-RI MSDC-RI MSDC-RI MSDC-RI
Column type CapillaryCapillaryCapillaryCapillaryCapillary
Active phase HP-5MSHP-5MSDB-1HP-5MSHP-5MS
Column length (m) 30.30.30.30.30.
Carrier gas  HeHeHeHe
Substrate
Column diameter (mm) 0.20.250.250.250.25
Phase thickness (μm)  0.250.250.250.25
Tstart (C) 60.60.50.60.60.
Tend (C) 280.280.265.280.280.
Heat rate (K/min) 3.4.2.53.3.
Initial hold (min)   1.
Final hold (min)   20.
I 1593.1591.1587.1595.1558.
ReferencePetrakis, Roussis, et al., 2005Sajjadi S.E. and Eskandari B., 2005Sarkhail, Amin, et al., 2005Slavkovska, Couladis, et al., 2005Tzakou, Bazos, et al., 2005
Comment MSDC-RI MSDC-RI MSDC-RI MSDC-RI MSDC-RI
Column type CapillaryCapillaryCapillaryCapillaryCapillary
Active phase DB-5HP-5CP Sil 5 CBRTX-1DB-5
Column length (m) 30.30.30.30.30.
Carrier gas HeHeN2N2He
Substrate
Column diameter (mm) 0.320.250.250.250.25
Phase thickness (μm) 0.250.320.250.250.25
Tstart (C) 60.60.50.60.60.
Tend (C) 280.250.200.300.300.
Heat rate (K/min) 3.5.5.4.3.
Initial hold (min)  3.
Final hold (min)
I 1565.1580.1590.1585.1580.
ReferenceTzakou and Constantinidis, 2005Aghel, Yamini, et al., 2004Agnaniet, Menut, et al., 2004Kalemba and Thiem, 2004Lago, de Ávila, et al., 2004
Comment MSDC-RI MSDC-RI MSDC-RI MSDC-RI MSDC-RI
Column type CapillaryCapillaryCapillaryCapillaryCapillary
Active phase NB-30DB-1HP-1DB-5DB-5
Column length (m) 50.30.30.30.30.
Carrier gas HeHeHeHeHe
Substrate
Column diameter (mm) 0.200.250.250.250.25
Phase thickness (μm) 0.250.250.330.250.25
Tstart (C) 50.50.40.60.60.
Tend (C) 250.265.260.240.300.
Heat rate (K/min) 2.2.52.3.3.
Initial hold (min)  1.5.
Final hold (min)  20.20.
I 1587.1587.1597.1586.1593.
ReferenceRaal, Paaver, et al., 2004Sarkhail, Amin, et al., 2004Senatore, Napolitano, et al., 2004Tellez, Khan, et al., 2004Tirillini, Pellegrino, et al., 2004
Comment MSDC-RI MSDC-RI MSDC-RI MSDC-RI MSDC-RI
Column type CapillaryCapillaryCapillaryCapillaryCapillary
Active phase HP-5RSL-200ZB-1OV-101DB-1
Column length (m) 30.30.30.50.50.
Carrier gas HeH2N2HeN2
Substrate
Column diameter (mm) 0.250.320.250.20.25
Phase thickness (μm) 0.250.250.250.50.25
Tstart (C) 60.40.45.50.95.
Tend (C) 280.280.230.250.240.
Heat rate (K/min) 4.6.3.2.4.
Initial hold (min)  5.
Final hold (min)  5.
I 1581.1596.1578.1575.1589.
ReferenceGhassemi, Sajjadi, et al., 2003Jirovetz, Buchbauer, et al., 2003Mierendorff, Stahl-Biskup, et al., 2003Orav, Kailas, et al., 2003Perez-Alonso, Velasco-Negueruela, et al., 2003
Comment MSDC-RI MSDC-RI MSDC-RI MSDC-RI MSDC-RI
Column type CapillaryCapillaryCapillaryCapillaryCapillary
Active phase DB-5DB-5HP-5DB-1HP-5
Column length (m) 30.30.30.60.25.
Carrier gas H2H2HeHeH2
Substrate
Column diameter (mm) 0.250.250.250.250.32
Phase thickness (μm) 0.250.250.250.250.53
Tstart (C) 60.60.60.40.40.
Tend (C) 280.280.280.260.280.
Heat rate (K/min) 4.4.3.4.4.
Initial hold (min) 10.10. 5.
Final hold (min) 40.40.
I 1590.1590.1573.1588.1591.
ReferencePino, Marbot, et al., 2003Pino, Marbot, et al., 2003Pitarokili, Tzakou, et al., 2003Sefidkon, Naderi Nik, et al., 2003Velickovic, Randjelovic, et al., 2003
Comment MSDC-RI MSDC-RI MSDC-RI MSDC-RI MSDC-RI
Column type CapillaryCapillaryCapillaryCapillaryCapillary
Active phase HP-5HP-5HP-5HP-5HP-5
Column length (m) 25.25.25.25.25.
Carrier gas H2HeliumHeliumHeliumHelium
Substrate
Column diameter (mm) 0.320.320.320.320.32
Phase thickness (μm) 0.530.530.530.530.53
Tstart (C) 40.40.40.40.40.
Tend (C) 280.280.280.280.280.
Heat rate (K/min) 4.4.4.4.4.
Initial hold (min)
Final hold (min)
I 1593.1586.1586.1587.1593.
ReferenceVelickovic, Randjelovic, et al., 2003Velickovic, Ristic, et al., 2003Velickovic, Ristic, et al., 2003Velickovic, Ristic, et al., 2003Velickovic, Ristic, et al., 2003
Comment MSDC-RI MSDC-RI MSDC-RI MSDC-RI MSDC-RI
Column type CapillaryCapillaryCapillaryCapillaryCapillary
Active phase DB-5DB-5PTE-5DB-5DB-5
Column length (m) 30.30.60.30.30.
Carrier gas HeHeH2 He
Substrate
Column diameter (mm) 0.250.250.320.250.25
Phase thickness (μm) 0.250.250.300.250.25
Tstart (C) 60.60.60.40.60.
Tend (C) 240.240.285.210.240.
Heat rate (K/min) 3.3.4.32.3.
Initial hold (min)    2.
Final hold (min)    33.
I 1591.1592.1590.1595.1589.
ReferenceZoghbi, Andrade, et al., 2003Flamini, Ertugrul, et al., 2002Gudzic, Djokovic, et al., 2002Kabouss, Charrouf, et al., 2002Kobaisy, Tellez, et al., 2002
Comment MSDC-RI MSDC-RI MSDC-RI MSDC-RI MSDC-RI
Column type CapillaryCapillaryCapillaryCapillaryCapillary
Active phase DB-5DB-5HP-5DB-1HP-5
Column length (m) 30.30.30.30.30.
Carrier gas HeHe He
Substrate
Column diameter (mm) 0.250.250.320.250.25
Phase thickness (μm) 0.250.250.250.250.25
Tstart (C) 35.35.100.60.60.
Tend (C) 280.280.240.250.240.
Heat rate (K/min) 3.4.5.4.3.
Initial hold (min) 2.2.2.10.
Final hold (min) 15.15.5.
I 1604.1599.1593.1629.1601.
ReferenceKrauze-Baranowska, Mardarowicz, et al., 2002Krauze-Baranowska, Mardarowicz, et al., 2002, 2Lago, Reis, et al., 2002Norouzi-Arasi, Yavari, et al., 2002Novak, Langbehn, et al., 2002
Comment MSDC-RI MSDC-RI MSDC-RI MSDC-RI MSDC-RI
Column type CapillaryCapillaryCapillaryCapillaryCapillary
Active phase DB-1DB-1HP-5HP-5RTX-1
Column length (m) 50.60.30.30.30.
Carrier gas N2HeH2N2N2
Substrate
Column diameter (mm) 0.250.250.250.250.25
Phase thickness (μm) 0.250.250.250.250.25
Tstart (C) 80.40.40.60.60.
Tend (C) 225.280.280.220.300.
Heat rate (K/min) 4.4.4.5.4.
Initial hold (min)  5. 10.
Final hold (min)
I 1575.1580.1590.1591.1586.
ReferencePalá-Paúl, Pérez-Alonso, et al., 2002Sefidkon, 2002Velickovic, Randjelovic, et al., 2002Flamini, Cioni, et al., 2001Kalemba, Marschall, et al., 2001
Comment MSDC-RI MSDC-RI MSDC-RI MSDC-RI MSDC-RI
Column type CapillaryCapillaryCapillaryCapillaryCapillary
Active phase DB-5MSOV-101DB-1DB-5PTE-5
Column length (m) 30.50.30.30.60.
Carrier gas HeHeN2H2H2
Substrate
Column diameter (mm) 0.250.20.250.250.32
Phase thickness (μm) 0.25 0.250.250.3
Tstart (C) 60.50.80.60.60.
Tend (C) 240.250.225.285.285.
Heat rate (K/min) 3.2.4.3.4.3
Initial hold (min)
Final hold (min) 30.
I 1569.1576.1561.1595.1590.
ReferenceMarongiu, Porcedda, et al., 2001Orav and Kann, 2001Palá-Paúl, Pérez-Alonso, et al., 2001Santos-Gomes and Fernandes-Ferreira, 2001Stojanovic, Palic, et al., 2001
Comment MSDC-RI MSDC-RI MSDC-RI MSDC-RI MSDC-RI
Column type CapillaryCapillaryCapillaryCapillaryCapillary
Active phase HP-5DB-1DB-5OV-1HP-1
Column length (m) 30.50.30.50.60.
Carrier gas HeHeHeHeHe
Substrate
Column diameter (mm) 0.250.250.250.320.25
Phase thickness (μm) 0.250.250.250.250.25
Tstart (C) 40.70.40.50.50.
Tend (C) 240.240.250.250.280.
Heat rate (K/min) 3.4.2.10.4.
Initial hold (min) 5. 5.5.5.
Final hold (min)   60.20.
I 1604.1562.1568.1594.1580.
ReferenceNovak, Novak, et al., 2000Palá-Paúl, Pérez-Alonso, et al., 1999Porta, Porcedda, et al., 1999Kökdil, Kurucu, et al., 1998Stashenko, Cervantes, et al., 1998
Comment MSDC-RI MSDC-RI MSDC-RI MSDC-RI MSDC-RI
Column type CapillaryCapillaryCapillaryCapillaryCapillary
Active phase DB-1DB-5CBP-1OV-1CP Sil 8 CB
Column length (m)  30.25.50.25.
Carrier gas  HeliumHeN2
Substrate
Column diameter (mm)  0.250.220.270.20
Phase thickness (μm)  0.25 0.2
Tstart (C) 80.60.60.80.60.
Tend (C) 220.240.240.240.230.
Heat rate (K/min) 6.3.5.3.3.
Initial hold (min)     10.
Final hold (min)
I 1569.1590.1591.1589.1603.
ReferenceSalgueiro, Vila, et al., 1997Tellez, Estell, et al., 1997Zygadlo, Ariza-Espinar, et al., 1997Ramanoelina, Viano, et al., 1994Jantan and Goh, 1990
Comment MSDC-RI MSDC-RI MSDC-RI MSDC-RI MSDC-RI
Column type CapillaryCapillaryCapillary
Active phase DB-1BP-1DB-1
Column length (m) 60.50.10.
Carrier gas  H2H2
Substrate
Column diameter (mm) 0.320.300.25
Phase thickness (μm)   0.25
Tstart (C) 50.40.50.
Tend (C) 250.250.250.
Heat rate (K/min) 4.10.5.
Initial hold (min) 0.11.
Final hold (min) 5.
I 1578.1593.1580.
ReferenceBinder and Flath, 1989Brophy, Davies, et al., 1989Perry, Baxter, et al., 1986
Comment MSDC-RI MSDC-RI MSDC-RI

Van Den Dool and Kratz RI, non-polar column, custom temperature program

Data compiled by: NIST Mass Spectrometry Data Center, William E. Wallace, director

Column type CapillaryCapillaryCapillaryCapillaryCapillary
Active phase HP-5MSCBP-5SPB-1DB-5MSCP Sil 8 CB
Column length (m) 30.30.27.30.50.
Carrier gas HeHeHeHeHe
Substrate
Column diameter (mm) 0.250.250.250.250.32
Phase thickness (μm) 0.250.250.250.25
Program 60C (1 min) => 5 C/min => 210C => 10 C/min => 280C (15 min)60C => 3C/min => 246C => 10C/min => 270C (5min)60C => 3C/min => 180C => 8C/min => 250C (5min)40C(5min) => 4C/min => 160C => 8C/min => 240C (15min)60C (2min) => 5C/min => 160C (1min) => 10C/min => 250C (2min)
I 1609.1592.1580.1600.1590.
ReferenceAndriamaharavo, 2014Silva, Oliveira, et al., 2007Sanz, Soria, et al., 2004Kim, Lee, et al., 2003Mockute and Judzentiene, 2003
Comment MSDC-RI MSDC-RI MSDC-RI MSDC-RI MSDC-RI
Column type Capillary
Active phase DB-5
Column length (m) 30.
Carrier gas He
Substrate
Column diameter (mm) 0.25
Phase thickness (μm) 0.25
Program 60C(2min) => 3C/min => 240C => 10C/min => 270C (4.5min)
I 1587.
ReferencePassos X.S., Castro A.C.M., et al., 2003
Comment MSDC-RI

Kovats' RI, non-polar column, custom temperature program

Data compiled by: NIST Mass Spectrometry Data Center, William E. Wallace, director

Column type CapillaryCapillaryCapillaryCapillaryCapillary
Active phase CP Sil 8 CBDB-5MSDB-5HP-5SF-96
Column length (m) 50.30.30.30.150.
Carrier gas HeHeHeH2
Substrate
Column diameter (mm) 0.320.250.250.320.75
Phase thickness (μm) 0.250.250.250.25
Program 60C(1min) => 3C/min => 70C => 15C/min => 170C(8min) => 5C/min => 250C60C(5min) => 2C/min => 140C= 5C/min => 250C(5min)35C => 4C/min => 180C => 20C/min => 280C60 0C (8 min) 3 K/min -> 180 0C 20 K/min (20 min)not specified
I 1593.1612.1580.1591.1588.
ReferenceRadusiene, Judzentiene, et al., 2005Tuberoso, Kowalczyk, et al., 2005Araújo, Silveira, et al., 2003Frizzo, Serafini, et al., 2001Malingré and Maarse, 1974
Comment MSDC-RI MSDC-RI MSDC-RI MSDC-RI MSDC-RI

References

Frizzo, Serafini, et al., 2001
Frizzo, C.D.; Serafini, L.A.; Dellacassa, E.; Lorenzo, D.; Moyna, P., Essential oil of Baccharis uncinella DC. from Southern Brazil, Flavour Fragr. J., 2001, 16, 4, 286-288, https://doi.org/10.1002/ffj.998 . [all data]