Butanoic acid, 3,4-bis[(trimethylsilyl)oxy]-, trimethylsilyl ester

Van Den Dool and Kratz RI, non-polar column, temperature ramp

Data compiled by: NIST Mass Spectrometry Data Center, William E. Wallace, director

Column type CapillaryCapillaryCapillaryCapillary
Active phase DB-5OV-1SE-52Ultra-2
Column length (m) 30.10.25.25.
Carrier gas HeHeHeHe
Substrate
Column diameter (mm) 0.250.220.320.31
Phase thickness (μm) 1.0.170.520.52
Tstart (C) 100.70.70.50.
Tend (C) 290.270.270.300.
Heat rate (K/min) 4.5.5.5.
Initial hold (min) 4.
Final hold (min) 10.
I 1439.1457.1448.1447.
ReferenceKimura, Yamamoto, et al., 1999Lefevere, Verhaeghe, et al., 1989Lefevere, Verhaeghe, et al., 1989Tuchman, Bowers, et al., 1984
Comment MSDC-RI MSDC-RI MSDC-RI MSDC-RI

References

Kimura, Yamamoto, et al., 1999
Kimura, M.; Yamamoto, T.; Yamaguchi, S., Automated metabolic profiling and interpretation of GC/MS data for organic acidemia screening: a personal computer-based system, Tohoku J. Exp. Med., 1999, 188, 4, 317-334, https://doi.org/10.1620/tjem.188.317 . [all data]

Lefevere, Verhaeghe, et al., 1989
Lefevere, M.F.; Verhaeghe, B.J.; Declerck, D.H.; Van Bocxlaer, J.F.; De Leenheer, A.P.; De Sagher, R.M., Metabolic Profiling of Urinary Organic Acids by Single and Multicolumn Capillary Gas Chromatography, J. Chromatogr. Sci., 1989, 27, 1, 23-29, https://doi.org/10.1093/chromsci/27.1.23 . [all data]

Tuchman, Bowers, et al., 1984
Tuchman, M.; Bowers, L.D.; Fregien, K.D.; Crippin, P.J.; Krivit, W., Capillary Gas Chromatographic Separation of Urinary Organic Acids. Retention Indices of 101 Urinary Acids on a 5% Phenylmethyl Silicone Capillary Column, J. Chromatogr. Sci., 1984, 22, 5, 198-202, https://doi.org/10.1093/chromsci/22.5.198 . [all data]