Pyrazine, 2-methyl-6-(1-propenyl)-, (Z)-

Normal alkane RI, non-polar column, custom temperature program

View large format table.

Column type Active phase I Reference Comment
CapillaryHP-51156.Characterization of Pyrazines in Some Chinese Liquors and Their Approximate Concentrations, 200730. m/0.25 mm/0.25 μm, He; Program: 50C(2min) => 2C/min => 140C => 10C/min => 280C (10min)

Normal alkane RI, polar column, temperature ramp

View large format table.

Column type Active phase I Reference Comment
CapillaryDB-Wax1628.Characterization of Pyrazines in Some Chinese Liquors and Their Approximate Concentrations, 200730. m/0.25 mm/0.25 μm, He, 4. K/min, 230. C @ 15. min; Tstart: 50. C

References

Characterization of Pyrazines in Some Chinese Liquors and Their Approximate Concentrations, 2007
Characterization of Pyrazines in Some Chinese Liquors; Their Approximate Concentrations, W. Fan; Y. Xu; Y. Zhang, J. Agric. Food Chem., 2007, 55, 9956-9962. [all data]