Nonadecane, 2,6,10,14-tetramethyl-

Normal alkane RI, non-polar column, custom temperature program

Data compiled by: NIST Mass Spectrometry Data Center, William E. Wallace, director

Column type CapillaryCapillary
Active phase SqualaneOV-1, SE-30, Methyl silicone, SP-2100, OV-101, DB-1, etc.
Column length (m)  50.
Carrier gas  Hydrogen
Substrate
Column diameter (mm)  0.32
Phase thickness (μm)
Program not specifiednot specified
I 2050.2020.
ReferencePetrov, 1984Waggott and Davies, 1984
Comment MSDC-RI MSDC-RI

References

Petrov, 1984
Petrov, A.A., Hydrocarbons of petroleum, Nauka (publishing house), Moscow, 1984, 263. [all data]

Waggott and Davies, 1984
Waggott, A.; Davies, I.W., Identification of organic pollutants using linear temperature programmed retention indices (LTPRIs) - Part II, 1984, retrieved from http://dwi.defra.gov.uk/research/completed-research/reports/dwi0383.pdf. [all data]