2,4,6(1H,3H,5H)-Pyrimidinetrione, 1,3-dimethyl-5-(2-methylpropyl)-5-(2-propenyl)-

Normal alkane RI, non-polar column, temperature ramp

View large format table.

Column type Active phase I Reference Comment
PackedSE-301553.MHA, 9999Nitrogen, Chromosorb G AW DMCS (80-100 mesh); Column length: 2. m; Tstart: 100. C; Tend: 300. C

References

MHA, 9999
MHA, Directorate of ForensicScience., Forensic Toxicology, 9999. [all data]