5-acetyl-2,3-1H-pyrrolizine

Normal alkane RI, polar column, temperature ramp

Data compiled by: NIST Mass Spectrometry Data Center, William E. Wallace, director

Column type CapillaryCapillary
Active phase Carbowax 20MCarbowax 20M
Column length (m) 25.25.
Carrier gas
Substrate
Column diameter (mm) 0.320.32
Phase thickness (μm) 0.3
Tstart (C) 35.70.
Tend (C) 200.180.
Heat rate (K/min) 4.2.
Initial hold (min) 3.
Final hold (min)
I 2033.2021.
ReferenceRoberts and Acree, 1994Tressl, Rewicki, et al., 1985
Comment MSDC-RI MSDC-RI

References

Roberts and Acree, 1994
Roberts, D.D.; Acree, T.E., Gas chromatography - olfactometry of glucose - proline Maillard reaction products in American Chemical Society, Symposium Series -- Volume 543, American Chemical Society, Washington, 1994, 71-79. [all data]

Tressl, Rewicki, et al., 1985
Tressl, R.; Rewicki, D.; Helak, B.; Kamperschröer, H.; Martin, N., Formation of 2,3-dihydro-1H-pyrrolizines as proline specific Maillard products, J. Agric. Food Chem., 1985, 33, 5, 919-923, https://doi.org/10.1021/jf00065a036 . [all data]