Tridecane, 4,8-dimethyl-

Van Den Dool and Kratz RI, polar column, temperature ramp

View large format table.

Column type Active phase I Reference Comment
CapillaryDB-Wax1488.Shimoda, Shigematsu, et al., 199560. m/0.25 mm/0.25 μm, 2. K/min; Tstart: 50. C; Tend: 230. C

Normal alkane RI, non-polar column, temperature ramp

View large format table.

Column type Active phase I Reference Comment
CapillaryCP Sil 5 CB1407.Höld, Schouten, et al., 199825. m/0.32 mm/0.45 μm, 0. C @ 5. min, 3. K/min, 300. C @ 10. min

References

Shimoda, Shigematsu, et al., 1995
Shimoda, M.; Shigematsu, H.; Shiratsuchi, H.; Osajima, Y., Comparison of the odor concentrates by SDE and adsorptive column method from green tea infusion, J. Agric. Food Chem., 1995, 43, 6, 1616-1620, https://doi.org/10.1021/jf00054a037 . [all data]

Höld, Schouten, et al., 1998
Höld, I.M.; Schouten, S.; van Kaam-Peters, H.M.E.; Sinninghe Damsté, J.S., Recognition of n-alkyl and isoprenoid algaenans in marine sediments by stable carbon isotopic analysis of pyrolysis products of kerogens, Org. Geochem., 1998, 28, 3-4, 179-194, https://doi.org/10.1016/S0146-6380(97)00130-7 . [all data]