8H-Cyclohepta[b]naphthalen-8-one,7,9-diethyl-

Gas phase ion energetics data

Data compiled by: Sharon G. Lias, Rhoda D. Levin, and Sherif A. Kafafi

Ionization energy determinations

IE (eV) Method Reference Comment
7.83 ± 0.03PEAllan, Heilbronner, et al., 1975Vertical value

References

Allan, Heilbronner, et al., 1975
Allan, M.; Heilbronner, E.; Kloster-Jensen, E., A photoelectron-spectroscopic investigation of benzologue tropones, J. Electron Spectrosc. Relat. Phenom., 1975, 6, 181. [all data]