4-Isopropyldicyclohexylmethane

Condensed phase thermochemistry data

Data compiled by: Hussein Y. Afeefy, Joel F. Liebman, and Stephen E. Stein

Quantity Value Units Method Reference Comment
Δcsolid-10200.kJ/molCcbLamneck and Wise, 1954Low boiling point isomer; Corresponding Δfsolid = -380. kJ/mol (simple calculation by NIST; no Washburn corrections)
Δcsolid-10180.kJ/molCcbLamneck and Wise, 1954High boiling point isomer; Corresponding Δfsolid = -410. kJ/mol (simple calculation by NIST; no Washburn corrections)

References

Lamneck and Wise, 1954
Lamneck, J.H., Jr.; Wise, P.H., Dicyclic hydrocarbons. X. Synthesis and physical properties of some propyl- and butyldiphenylmethanes and 4-isopropyldicyclohexylmethane, J. Am. Chem. Soc., 1954, 76, 3475-3476. [all data]