Perfluorobicyclo-[4.4.0]-dec-1,6-ene

Phase change data

Data compiled as indicated in comments:
TRC - Thermodynamics Research Center, NIST Boulder Laboratories, Chris Muzny director
AC - William E. Acree, Jr., James S. Chickos
DH - Eugene S. Domalski and Elizabeth D. Hearing

Quantity Value Units Method Reference Comment
Ttriple264.09KN/AZhogin, Kosarukina, et al., 1981Crystal phase 1 phase; Uncertainty assigned by TRC = 0.02 K; TRC
Quantity Value Units Method Reference Comment
Δvap45.3 ± 0.1kJ/molCVarushchenko, Druzhinina, et al., 1996AC

Enthalpy of fusion

ΔfusH (kJ/mol) Temperature (K) Reference Comment
10.47263.Domalski and Hearing, 1996AC

Enthalpy of phase transition

ΔHtrs (kJ/mol) Temperature (K) Initial Phase Final Phase Reference Comment
0.794200.0crystaline, IIIcrystaline, IIZhogin, Kosarukina, et al., 1981DH
1.113233.4crystaline, IIcrystaline, IZhogin, Kosarukina, et al., 1981DH
10.473264.09crystaline, IliquidZhogin, Kosarukina, et al., 1981DH

Entropy of phase transition

ΔStrs (J/mol*K) Temperature (K) Initial Phase Final Phase Reference Comment
3.77200.0crystaline, IIIcrystaline, IIZhogin, Kosarukina, et al., 1981DH
4.77233.4crystaline, IIcrystaline, IZhogin, Kosarukina, et al., 1981DH
39.66264.09crystaline, IliquidZhogin, Kosarukina, et al., 1981DH

In addition to the Thermodynamics Research Center (TRC) data available from this site, much more physical and chemical property data is available from the following TRC products:

References

Zhogin, Kosarukina, et al., 1981
Zhogin, D.Yu.; Kosarukina, E.A.; Kolesov, V.P.; Prokudin, I.P.; Mel'nichenko, B.A., The heat capacity in the temperature range 6-300 K, phase transformations, and thermodynamic functions of perfluorobicyclo(4,4,0)dec-1,6-ene, Zhur. Fiz. Khim., 1981, 55, 98-103. [all data]

Varushchenko, Druzhinina, et al., 1996
Varushchenko, Raisa M.; Druzhinina, Anna I.; Pashchenko, Larisa L., Thermodynamics of vaporization of some cyclic perfluorocarbons, Fluid Phase Equilibria, 1996, 126, 1, 93-104, https://doi.org/10.1016/S0378-3812(96)03111-1 . [all data]

Domalski and Hearing, 1996
Domalski, Eugene S.; Hearing, Elizabeth D., Heat Capacities and Entropies of Organic Compounds in the Condensed Phase. Volume III, J. Phys. Chem. Ref. Data, 1996, 25, 1, 1, https://doi.org/10.1063/1.555985 . [all data]