Benzene,1-(dicyclopropylmethoxy)-4-methoxy-

Gas phase ion energetics data

Data compiled by: Sharon G. Lias, Rhoda D. Levin, and Sherif A. Kafafi

Ionization energy determinations

IE (eV) Method Reference Comment
7.80 ± 0.015PEKlessinger, Asmus, et al., 1975Vertical value

References

Klessinger, Asmus, et al., 1975
Klessinger, M.; Asmus, P.; Kraatz, U., Photoelektronenspektren organischer verbindungen-VII, Tetrahedron, 1975, 31, 517. [all data]