Thiourea-ferrocene

Phase change data

Data compiled by: Eugene S. Domalski and Elizabeth D. Hearing

Enthalpy of phase transition

ΔHtrs (kcal/mol) Temperature (K) Initial Phase Final Phase Reference Comment
0.0629147.2crystaline, Vcrystaline, IVSorai, Ogasahara, et al., 1981
0.3521159.79crystaline, IVcrystaline, IIISorai, Ogasahara, et al., 1981
0.0033171.4crystaline, IIIcrystaline, IISorai, Ogasahara, et al., 1981
0.0084185.5crystaline, IIcrystaline, ISorai, Ogasahara, et al., 1981
0.018220.crystaline, IIIcrystaline, ISorai, Ogasahara, et al., 1981

Entropy of phase transition

ΔStrs (cal/mol*K) Temperature (K) Initial Phase Final Phase Reference Comment
0.43147.2crystaline, Vcrystaline, IVSorai, Ogasahara, et al., 1981
2.21159.79crystaline, IVcrystaline, IIISorai, Ogasahara, et al., 1981
0.019171.4crystaline, IIIcrystaline, IISorai, Ogasahara, et al., 1981
0.0449185.5crystaline, IIcrystaline, ISorai, Ogasahara, et al., 1981
0.086220.crystaline, IIIcrystaline, ISorai, Ogasahara, et al., 1981

References

Sorai, Ogasahara, et al., 1981
Sorai, M.; Ogasahara, K.; Suga, H., Heat capacity and phase transitions of thiourea-ferrocene channel inclusion compound, Mol. Cryst. Liq. Cryst., 1981, 73, 231-254. [all data]