(Z)-1-Methyl-4-(2-phenylethenyl)sulphonylbenzene

Gas phase thermochemistry data

Data compiled by: Hussein Y. Afeefy, Joel F. Liebman, and Stephen E. Stein

Quantity Value Units Method Reference Comment
Δfgas-59.8 ± 5.0kJ/molCcrMackle, McNally, et al., 1969Heat of combustion corrected for pressure

Condensed phase thermochemistry data

Data compiled by: Hussein Y. Afeefy, Joel F. Liebman, and Stephen E. Stein

Quantity Value Units Method Reference Comment
Δfsolid-176.0 ± 3.4kJ/molCcrMackle, McNally, et al., 1969Heat of combustion corrected for pressure
Quantity Value Units Method Reference Comment
Δcsolid-8329.5 ± 3.3kJ/molCcrMackle, McNally, et al., 1969Heat of combustion corrected for pressure

References

Mackle, McNally, et al., 1969
Mackle, H.; McNally, D.V.; Steele, W.V., Studies in the thermochemistry of sulphones. Part 10. Heats of combustion and formation of several αβ-unsaturated sulphones, Trans. Faraday Soc., 1969, 65, 2060-2068. [all data]