Pentanoic acid, 3-methyl-2-[(trimethylsilyl)oxy]-, trimethylsilyl ester

Van Den Dool and Kratz RI, non-polar column, temperature ramp

Data compiled by: NIST Mass Spectrometry Data Center, William E. Wallace, director

Column type CapillaryCapillaryCapillaryCapillary
Active phase DB-5OV-1SE-52SE-52
Column length (m) 30.10.25.25.
Carrier gas HeHeHeHe
Substrate
Column diameter (mm) 0.250.220.320.20
Phase thickness (μm) 1.0.170.520.40
Tstart (C) 100.70.70.50.
Tend (C) 290.270.270.270.
Heat rate (K/min) 4.5.5.5.
Initial hold (min) 4.
Final hold (min) 10.
I 1250.1253.1253.1253.
ReferenceKimura, Yamamoto, et al., 1999Lefevere, Verhaeghe, et al., 1989Lefevere, Verhaeghe, et al., 1989Lefevere, Verhaeghe, et al., 1988
Comment MSDC-RI MSDC-RI MSDC-RI MSDC-RI

Van Den Dool and Kratz RI, non-polar column, custom temperature program

Data compiled by: NIST Mass Spectrometry Data Center, William E. Wallace, director

Column type Capillary
Active phase DB-1
Column length (m)
Carrier gas He
Substrate
Column diameter (mm)
Phase thickness (μm)
Program not specified
I 1247.
ReferenceTsai, Oliphant, et al., 1985
Comment MSDC-RI

Normal alkane RI, non-polar column, temperature ramp

View large format table.

Column type Active phase I Reference Comment
CapillaryHP-51253.Isidorov, Kotowska, et al., 200530. m/0.25 mm/0.25 μm, He; Tstart: 50. C; Tend: 300. C
CapillaryHP-5MS1253.Lee, Yanamandra, et al., 200230. m/0.25 mm/0.25 μm, He, 70. C @ 3. min, 4. K/min, 280. C @ 3. min

References

Kimura, Yamamoto, et al., 1999
Kimura, M.; Yamamoto, T.; Yamaguchi, S., Automated metabolic profiling and interpretation of GC/MS data for organic acidemia screening: a personal computer-based system, Tohoku J. Exp. Med., 1999, 188, 4, 317-334, https://doi.org/10.1620/tjem.188.317 . [all data]

Lefevere, Verhaeghe, et al., 1989
Lefevere, M.F.; Verhaeghe, B.J.; Declerck, D.H.; Van Bocxlaer, J.F.; De Leenheer, A.P.; De Sagher, R.M., Metabolic Profiling of Urinary Organic Acids by Single and Multicolumn Capillary Gas Chromatography, J. Chromatogr. Sci., 1989, 27, 1, 23-29, https://doi.org/10.1093/chromsci/27.1.23 . [all data]

Lefevere, Verhaeghe, et al., 1988
Lefevere, M.F.; Verhaeghe, B.J.; Declerck, D.M.; de Leenheer, A.P., Automated profiling of urinary organic acids by dual-column gas chromatography and gas chromatography/mass spectrometry, Biomed. Environ. Mass Spectrom., 1988, 15, 6, 311-322, https://doi.org/10.1002/bms.1200150603 . [all data]