Iron, (4,4,5,5-tetramethyl-1,3-dioxolan-2-ylidene)-tetracarbonyl-

Gas phase ion energetics data

Data compiled by: Sharon G. Lias, Rhoda D. Levin, and Sherif A. Kafafi

Ionization energy determinations

IE (eV) Method Reference Comment
6.8PEBohm, Daub, et al., 1980
7.3PEBohm, Daub, et al., 1980Vertical value

References

Bohm, Daub, et al., 1980
Bohm, M.C.; Daub, J.; Gleiter, R.; Hofmann, P.; Lappert, M.F.; Ofele, K., Die He(I) photoelektronenspektren von tetracarbonyleisen(O)-komplexen mit carbenen, Chem. Ber., 1980, 113, 3629. [all data]