Cyclohexane, 1,1'-(2-ethyl-1,3-propanediyl)bis-

Condensed phase thermochemistry data

Data compiled by: Hussein Y. Afeefy, Joel F. Liebman, and Stephen E. Stein

Quantity Value Units Method Reference Comment
Δcliquid-10230.kJ/molCcbCaves, McLaughlin, et al., 1954Corresponding Δfliquid = -1030. kJ/mol (simple calculation by NIST; no Washburn corrections)

References

Caves, McLaughlin, et al., 1954
Caves, R.M.; McLaughlin, R.L.; Wise, P.H., Dicyclic hydrocarbons. VII. Synthesis and physical properties of some 1,3-diphenyl- and 1,3-dicyclohexyl-2-alkylpropane hydrocarbons, J. Am. Chem. Soc., 1954, 76, 522-524. [all data]