2,8,9-Trioxa-5-aza-1-silabicyclo[3.3.3]undecane, 3,7,10-trimethyl-1-phenyl-

Gas phase ion energetics data

Data compiled by: Sharon G. Lias and Joel F. Liebman

Ionization energy determinations

IE (eV) Method Reference Comment
8.01PEPeel and Dianxum, 1988
8.5 ± 0.1PEPeel and Dianxum, 1988Vertical value

References

Peel and Dianxum, 1988
Peel, J.B.; Dianxum, W., Photoelectron spectroscopic studies of the electronic structures of some silatranes, J. Chem. Soc. Dalton Trans., 1988, 1963. [all data]