Cyclohexane, 1-(cyclohexylmethyl)-3-methyl-, cis-

Condensed phase thermochemistry data

Data compiled by: Hussein Y. Afeefy, Joel F. Liebman, and Stephen E. Stein

Quantity Value Units Method Reference Comment
Δcliquid-1985.kcal/molCcbLamneck and Wise, 1954Corresponding Δfliquid = -220. kcal/mol (simple calculation by NIST; no Washburn corrections)

References

Lamneck and Wise, 1954
Lamneck, J.H., Jr.; Wise, P.H., Dicyclic hydrocarbons. IX. Synthesis and physical properties of the monomethyldiphenylmethanes and monomethyldicyclohexylmethanes, J. Am. Chem. Soc., 1954, 76, 1104-1106. [all data]