2H-Pyran-2-one, 5,6-dihydro-6-pentyl-

Van Den Dool and Kratz RI, non-polar column, custom temperature program

Data compiled by: NIST Mass Spectrometry Data Center, William E. Wallace, director

Column type CapillaryCapillary
Active phase HP-5MSHP-1
Column length (m) 30.50.
Carrier gas HeHe
Substrate
Column diameter (mm) 0.250.32
Phase thickness (μm) 0.251.05
Program 60C (1 min) => 5 C/min => 210C => 10 C/min => 280C (15 min)20C(0.5min) => 60C => 4C/min => 250C
I 1501.21499.
ReferenceAndriamaharavo, 2014Sing, Smadja, et al., 1992
Comment MSDC-RI MSDC-RI

Normal alkane RI, polar column, custom temperature program

Data compiled by: NIST Mass Spectrometry Data Center, William E. Wallace, director

Column type Capillary
Active phase FFAP
Column length (m)
Carrier gas Helium
Substrate
Column diameter (mm)
Phase thickness (μm)
Program not specified
I 2207.
ReferenceFrauendorfer and Schieberle, 2008
Comment MSDC-RI

References

Andriamaharavo, 2014
Andriamaharavo, N.R., Retention Data. NIST Mass Spectrometry Data Center., NIST Mass Spectrometry Data Center, 2014. [all data]

Sing, Smadja, et al., 1992
Sing, A.S.C.; Smadja, J.; Brevard, H.; Maignial, L.; Chaintreau, A.; Marion, J.-P., Volatile constituents of faham (Jumellea fragrans (Thou.) Schltr.), J. Agric. Food Chem., 1992, 40, 4, 642-646, https://doi.org/10.1021/jf00016a024 . [all data]