Bicyclo[3.1.1]heptan-3-one, 2,6,6-trimethyl-, (1α,2α,5α)-

Normal alkane RI, non-polar column, temperature ramp

Data compiled by: NIST Mass Spectrometry Data Center, William E. Wallace, director

Column type CapillaryCapillaryCapillaryCapillaryCapillary
Active phase HP-5HP-5HP-5DB-5SPB-1
Column length (m) 25.25.25.30.30.
Carrier gas HydrogenHydrogenHydrogenHeliumHelium
Substrate
Column diameter (mm) 0.320.320.320.250.20
Phase thickness (μm) 0.520.520.520.250.20
Tstart (C) 40.40.40.50.70.
Tend (C) 280.280.280.250.220.
Heat rate (K/min) 4.4.4.2.3.
Initial hold (min)
Final hold (min) 10.10.10. 15.
I 1156.1156.1156.1163.1134.
ReferenceVelickovic, Ristic, et al., 2012Velickovic, Ristic, et al., 2012Velickovic, Ristic, et al., 2012Ho, Wang, et al., 2010Neves, Rosa, et al., 2010
Comment MSDC-RI MSDC-RI MSDC-RI MSDC-RI MSDC-RI
Column type CapillaryCapillaryCapillaryCapillaryCapillary
Active phase SE-54HP-5 MSHP-5 MSDB-5SPB-1
Column length (m) 30.30.30.30.30.
Carrier gas HeliumHeliumHeliumHeHe
Substrate
Column diameter (mm) 0.250.250.250.250.2
Phase thickness (μm) 0.250.250.250.250.2
Tstart (C) 60.50.50.35.70.
Tend (C) 260.230.230.220.220.
Heat rate (K/min) 2.3.3.3.3.
Initial hold (min) 5.10.10.
Final hold (min) 999.10.10.40.15.
I 1156.1177.1160.1161.1134.
ReferenceDayisoylu and Alma, 2009Adams, Beauchamp, et al., 2007Adams, Beauchamp, et al., 2007El-Ghorab A., El-Massry K.F., et al., 2007Pinto, Salgueiro, et al., 2007
Comment MSDC-RI MSDC-RI MSDC-RI MSDC-RI MSDC-RI
Column type CapillaryCapillaryCapillaryCapillaryCapillary
Active phase DB-1AT-5DB-1CP Sil 5 CBHP-1
Column length (m) 60.60.60.30.50.
Carrier gas HeHe
Substrate
Column diameter (mm) 0.250.250.250.250.2
Phase thickness (μm) 0.250.250.250.250.25
Tstart (C) 60.60.60.40.60.
Tend (C) 250.200.250.220.250.
Heat rate (K/min) 5.4.5.3.2.
Initial hold (min)     60.
Final hold (min)  20.10.3.
I 1142.1174.1158.1163.1144.
ReferenceSalehi, Fakhari, et al., 2007Borges, Rojas, et al., 2006Hadian, Sonboli, et al., 2006Hymete, Rohloff, et al., 2006Fernandez, Lizzani-Cuvelier, et al., 2005
Comment MSDC-RI MSDC-RI MSDC-RI MSDC-RI MSDC-RI
Column type CapillaryCapillaryCapillaryCapillaryCapillary
Active phase HP-5MSDB-1DB-5HP-5DB-1
Column length (m) 30.50.60.30.50.
Carrier gas   HeHeN2
Substrate
Column diameter (mm) 0.250.250.250.250.25
Phase thickness (μm) 0.250.250.250.250.25
Tstart (C) 50.60.40.60.60.
Tend (C) 250.240.280.280.240.
Heat rate (K/min) 3.3.4.3.3.
Initial hold (min) 10. 4.
Final hold (min) 5.
I 1176.1135.1159.1144.1135.
ReferenceMelkani, Dev, et al., 2005Velasco-Negueruela, Pérez-Alonso, et al., 2005Kalvandi, Sefidkon, et al., 2004Pitarokili, Tzakou, et al., 2003Velasco-Negueruela, Pérez-Alonso, et al., 2002
Comment MSDC-RI MSDC-RI MSDC-RI MSDC-RI MSDC-RI
Column type CapillaryCapillary
Active phase DB-5RSL-150
Column length (m) 30.30.
Carrier gas He
Substrate
Column diameter (mm) 0.250.32
Phase thickness (μm) 0.250.20
Tstart (C) 60.30.
Tend (C) 240.200.
Heat rate (K/min) 3.3.
Initial hold (min)
Final hold (min)
I 1161.1138.
ReferenceTellez, Canel, et al., 1999Ronse and De Pooter, 1990
Comment MSDC-RI MSDC-RI

Van Den Dool and Kratz RI, non-polar column, custom temperature program

Data compiled by: NIST Mass Spectrometry Data Center, William E. Wallace, director

Column type Capillary
Active phase HP-5MS
Column length (m) 30.
Carrier gas He
Substrate
Column diameter (mm) 0.25
Phase thickness (μm) 0.25
Program 60C (1 min) => 5 C/min => 210C => 10 C/min => 280C (15 min)
I 1166.4
ReferenceAndriamaharavo, 2014
Comment MSDC-RI

Normal alkane RI, polar column, temperature ramp

Data compiled by: NIST Mass Spectrometry Data Center, William E. Wallace, director

Column type CapillaryCapillaryCapillaryCapillaryCapillary
Active phase Supelcowax-10TC-FFAPTC-FFAPSupelcowax-10CP-Wax 52CB
Column length (m) 30.  30.30.
Carrier gas HeliumHeHeHeHe
Substrate
Column diameter (mm) 0.200.250.250.20.32
Phase thickness (μm) 0.200.250.250.20.25
Tstart (C) 70.60.60.70.60.
Tend (C) 220.220.220.220.220.
Heat rate (K/min) 3.3.3.3.3.3
Initial hold (min)     7.
Final hold (min) 15.30.30.15.3.
I 1511.1523.1525.1516.1578.
ReferenceNeves, Rosa, et al., 2010Kurose, Okamura, et al., 2007Kurose, Okamura, et al., 2007Pinto, Salgueiro, et al., 2007Hymete, Rohloff, et al., 2006
Comment MSDC-RI MSDC-RI MSDC-RI MSDC-RI MSDC-RI
Column type CapillaryCapillaryCapillary
Active phase Carbowax 20MDB-WaxCarbowax 20M
Column length (m) 50.60.45.
Carrier gas   Hydrogen
Substrate
Column diameter (mm) 0.20.250.32
Phase thickness (μm) 0.250.251.0
Tstart (C) 60.30.60.
Tend (C) 250.170.200.
Heat rate (K/min) 2.2.2.
Initial hold (min) 60.4.5.
Final hold (min)  30.
I 1504.1548.1529.
ReferenceFernandez, Lizzani-Cuvelier, et al., 2005Buttery, Light, et al., 2000Kollmannsberger, Nitz, et al., 1992
Comment MSDC-RI MSDC-RI MSDC-RI

Normal alkane RI, polar column, custom temperature program

Data compiled by: NIST Mass Spectrometry Data Center, William E. Wallace, director

Column type CapillaryCapillaryCapillaryCapillaryCapillary
Active phase HP-Innowax FSCInnowax FSCInnowax FSCFFAPDB-Wax
Column length (m) 60.60.60.25.60.
Carrier gas HeHe H2N2
Substrate
Column diameter (mm) 0.250.250.250.2
Phase thickness (μm) 0.250.250.250.330.25
Program 60C(10min) => 4C/min => 220C(10min) => 1C/min => 240C60C(10min) => 4C/min => 220C (10min) => 1C/min => 240C60C(10min) => 4C/min => 220C(10min) => 1C/min => 240C40C(5min) => 4C/min => 170C => 8C/min => 240C (12min)not specified
I 1535.1536.1535.1534.1536.
ReferenceSezik E., Kocakulak E., et al., 2005Baser, Demirci, et al., 2003Tunalier, Kirimer, et al., 2002Reddy, Angers, et al., 1998Weyerstahl, Marschall, et al., 1998
Comment MSDC-RI MSDC-RI MSDC-RI MSDC-RI MSDC-RI
Column type Capillary
Active phase NB-351
Column length (m) 25.
Carrier gas
Substrate
Column diameter (mm) 0.32
Phase thickness (μm) 0.2
Program 40C(5min) => 4C/min => 170C => 8C/min => 240C (12min)
I 1506.
ReferenceKerrola, Galambosi, et al., 1994
Comment MSDC-RI

Kovats' RI, non-polar column, custom temperature program

Data compiled by: NIST Mass Spectrometry Data Center, William E. Wallace, director

Column type Capillary
Active phase DB-5
Column length (m) 30.
Carrier gas
Substrate
Column diameter (mm) 0.26
Phase thickness (μm) 0.25
Program not specified
I 1160.
ReferenceAdams, 1998
Comment MSDC-RI

References

Velickovic, Ristic, et al., 2012
Velickovic, D.T.; Ristic, M.S.; Karabegovic, I.T.; Stojicevic, S.S.; Lazic, M.L., The influence of the distillation method on the chemical composition of the essential oil of sage (Salvia officinalis L.), Advanced Technologies, 2012, 1, 1, 47-51. [all data]

Ho, Wang, et al., 2010
Ho, C.-L.; Wang, E.I.-C.; Yu, H.-T.; Yu, H.-M.; Su, Y.-C., Composition amd antioxidant activities of essential oils of different tissues from Cryptomeria japonica D. Don, Quarterly J. Chin. Forestry, 2010, 32, 1, 63-76. [all data]

Neves, Rosa, et al., 2010
Neves, A.; Rosa, S.; Goncalves, J.; Rufino, A.; Judas, F.; Salgueiro, L.; Lopes, M.C.; Cavaleiro, C.; Mendes, A.F., Screening of five essential oils for identification of potential inhibitors of IL-1-unduced Nf-kB activation and NO production in human clondrocytes: characterization of the inhibitory activity of alpha-pinene, Plante Med., 2010, 76, 03, 303-308, https://doi.org/10.1055/s-0029-1186085 . [all data]

Dayisoylu and Alma, 2009
Dayisoylu, K.S.; Alma, M.H., Chemical analysis of essential oils from cone's rosin of Cilician fir (Abies cilicica subsp. cilicica), Afr. J. Biotechnol., 2009, 8, 15, 3502-3505. [all data]

Adams, Beauchamp, et al., 2007
Adams, R.P.; Beauchamp, P.S.; Dev, V.; Dutz, S.M., New Natural Products Isolated from One-Seeded Juniperus of the Southwestern United States: Isolation and Occurence of 2-Ethenyl-3-methyl Phanol and Its Derivatives, J. Essent. Oil Res., 2007, 19, 2, 146-152, https://doi.org/10.1080/10412905.2007.9699247 . [all data]

El-Ghorab A., El-Massry K.F., et al., 2007
El-Ghorab A.; El-Massry K.F.; Shibamoto T., Chemical composition of the volatile extract and antioxidant activities of the volatile and nonvolatile extracts of Egyptian corn silk (Zea mays L.), J. Agric. Food Chem., 2007, 55, 22, 9124-9127, https://doi.org/10.1021/jf071646e . [all data]

Pinto, Salgueiro, et al., 2007
Pinto, E.; Salgueiro, L.R.; Cavaleiro, C.; Palmeira, A.; Goncalves, M.J., In vitro susceptibility of some species of yeasts and filamentous fungi to essential oils of Salvia of?cinalis, Ind. Crops Prod., 2007, 26, 2, 135-141, https://doi.org/10.1016/j.indcrop.2007.02.004 . [all data]

Salehi, Fakhari, et al., 2007
Salehi, P.; Fakhari, A.R.; Ebrahimi, S.N.; Heydari, R., Rapid essential oil screening of Rosmarinus officinalis L. by hydrodistillation-headspace solvent microextraction, Flavour Fragr. J., 2007, 22, 4, 280-285, https://doi.org/10.1002/ffj.1793 . [all data]

Borges, Rojas, et al., 2006
Borges, R.; Rojas, L.B.; Cegarra, J.A.; Usubillaga, A., Study of the essential oils from the leaves and flowers of Lepechinia conferta (Benth) Epl., Flavour Fragr. J., 2006, 21, 1, 155-157, https://doi.org/10.1002/ffj.1550 . [all data]

Hadian, Sonboli, et al., 2006
Hadian, J.; Sonboli, A.; Ebrahimi, S.N.; Mirjalili, M.H., Essential oil composition of Nepeta satureioides from Iran, Chem. Nat. Compd. (Engl. Transl.), 2006, 42, 2, 175-177, https://doi.org/10.1007/s10600-006-0071-0 . [all data]

Hymete, Rohloff, et al., 2006
Hymete, A.; Rohloff, J.; Iversen, T.-H., Essential oil from seeds and husks of Aframomum corrorima from Ethiopia, Flavour Fragr. J., 2006, 21, 4, 642-644, https://doi.org/10.1002/ffj.1634 . [all data]

Fernandez, Lizzani-Cuvelier, et al., 2005
Fernandez, X.; Lizzani-Cuvelier, L.; Loiseau, A.-M.; Perichet, C.; Delbecque, C.; Arnaudo, J.-F., Chemical composition of the essential oils from Turkish and Honduras Styrax, Flavour Fragr. J., 2005, 20, 1, 70-73, https://doi.org/10.1002/ffj.1370 . [all data]

Melkani, Dev, et al., 2005
Melkani, A.B.; Dev, V.; Beauchamp, P.S.; Negi, A.; Mehta, S.P.S.; Melkani, K.B., Constituents of the essential oil of a new chemotype of Elsholtzia strobilifera Benth., Biochem. Syst. Ecol., 2005, 33, 4, 419-425, https://doi.org/10.1016/j.bse.2004.10.009 . [all data]

Velasco-Negueruela, Pérez-Alonso, et al., 2005
Velasco-Negueruela, A.; Pérez-Alonso, M.J.; Palá-Paúl, J.; Iñigo, A.; López, G., The volatile oil composition of the berries of Juniperus macrocarpa Sibth. and Sm., gathered in Spain, J. Essent. Oil Res., 2005, 17, 1, 61-63, https://doi.org/10.1080/10412905.2005.9698831 . [all data]

Kalvandi, Sefidkon, et al., 2004
Kalvandi, R.; Sefidkon, F.; Atri, M.; Mirza, M., Analysis of the essential oil of Thymus eriocalyx from Iran, Flavour Fragr. J., 2004, 19, 4, 341-343, https://doi.org/10.1002/ffj.1312 . [all data]

Pitarokili, Tzakou, et al., 2003
Pitarokili, D.; Tzakou, O.; Loukis, A.; Harvala, C., Volatile metabolites from Salvia fruticosa as antifungal agents in soilborne pathogens, J. Agric. Food Chem., 2003, 51, 11, 3294-3301, https://doi.org/10.1021/jf0211534 . [all data]

Velasco-Negueruela, Pérez-Alonso, et al., 2002
Velasco-Negueruela, A.; Pérez-Alonso, M.J.; Palá-Paúl, J.; Íñigo, A.; López, G., Leaf essential oils analysis of Juniperus navicularis Gandoger, Botanica Complutensis, 2002, 26, 85-91. [all data]

Tellez, Canel, et al., 1999
Tellez, M.R.; Canel, C.; Rimando, A.M.; Duke, S.O., Differential accumulation of isoprenoids in glanded and glandless Artemisia annua L, Phytochemistry, 1999, 52, 6, 1035-1040, https://doi.org/10.1016/S0031-9422(99)00308-8 . [all data]

Ronse and De Pooter, 1990
Ronse, A.C.; De Pooter, H.L., Essential Oil Production by Belgian Artemisia alba (Turra) before and after Micropropagation, J. Essent. Oil Res., 1990, 2, 5, 237-242, https://doi.org/10.1080/10412905.1990.9697873 . [all data]