N,N-dihexyl lactamide

Phase change data

Data compiled by: William E. Acree, Jr., James S. Chickos

Enthalpy of vaporization

ΔvapH (kcal/mol) Temperature (K) Method Reference Comment
19.0433.AStephenson and Malanowski, 1987Based on data from 418. - 453. K.

References

Stephenson and Malanowski, 1987
Stephenson, Richard M.; Malanowski, Stanislaw, Handbook of the Thermodynamics of Organic Compounds, 1987, https://doi.org/10.1007/978-94-009-3173-2 . [all data]