1,5-Heptadien-4-one, 3,3,6-trimethyl-

Van Den Dool and Kratz RI, non-polar column, temperature ramp

Data compiled by: NIST Mass Spectrometry Data Center, William E. Wallace, director

Column type CapillaryCapillaryCapillaryCapillaryCapillary
Active phase RTX-1HP-5MSDB-5DB-1DB-1
Column length (m) 60.30.50.30.30.
Carrier gas HeHeN2N2
Substrate
Column diameter (mm) 0.220.250.20.250.32
Phase thickness (μm) 0.250.250.320.250.25
Tstart (C) 60.60.60.50.50.
Tend (C) 230.280.220.200.250.
Heat rate (K/min) 2.3.5.5.2.
Initial hold (min)   3. 8.
Final hold (min) 30. 5.
I 1041.1064.1062.1069.1040.
ReferenceMuselli, Rossi, et al., 2007Vagionas, Ngassapa, et al., 2007Esmaeili, Nematollahi, et al., 2006Agnaniet, Makani, et al., 2005Dob, Dahmane, et al., 2005
Comment MSDC-RI MSDC-RI MSDC-RI MSDC-RI MSDC-RI
Column type CapillaryCapillary
Active phase DB-5HP-5
Column length (m) 30.30.
Carrier gas HeHe
Substrate
Column diameter (mm) 0.250.25
Phase thickness (μm) 0.250.25
Tstart (C) 40.60.
Tend (C) 260.280.
Heat rate (K/min) 2.3.
Initial hold (min) 5.
Final hold (min) 20.
I 1070.1062.
ReferenceSenatore, Napolitano, et al., 2005Ngassapa, Runyoro, et al., 2003
Comment MSDC-RI MSDC-RI

Van Den Dool and Kratz RI, polar column, temperature ramp

Data compiled by: NIST Mass Spectrometry Data Center, William E. Wallace, director

Column type CapillaryCapillary
Active phase RTX-WaxHP-20M
Column length (m) 60.50.
Carrier gas HeHe
Substrate
Column diameter (mm) 0.220.2
Phase thickness (μm) 0.250.2
Tstart (C) 60.70.
Tend (C) 230.180.
Heat rate (K/min) 2.4.
Initial hold (min)  4.
Final hold (min) 30.10.
I 1348.1328.
ReferenceMuselli, Rossi, et al., 2007Jerkovic, Mastelic, et al., 2003
Comment MSDC-RI MSDC-RI

References

Muselli, Rossi, et al., 2007
Muselli, A.; Rossi, P.-G.; Desjobert, J.-M.; Bernardini, A.-F.; Berti, L.; Costa, J., Chemical composition and antibacterial activity of Otanthus maritimus (L.) Hoffmanns. Link essential oils from Corsica, Flavour Fragr. J., 2007, 22, 3, 217-223, https://doi.org/10.1002/ffj.1787 . [all data]

Vagionas, Ngassapa, et al., 2007
Vagionas, K.; Ngassapa, O.; Runyoro, D.; Graikou, K.; Gortzi, O.; Chinou, I., Chemical analysis of edible aromatic plants growing in Tanzania, Food Chem., 2007, 105, 4, 1711-1717, https://doi.org/10.1016/j.foodchem.2007.05.029 . [all data]

Esmaeili, Nematollahi, et al., 2006
Esmaeili, A.; Nematollahi, F.; Rustaiyan, A.; Moazami, N.; Masoudi, S.; Bamasian, S., Volatile constituents of Achillea pachycephala, A. oxyodonta and A. biebersteinii from Iran, Flavour Fragr. J., 2006, 21, 2, 253-256, https://doi.org/10.1002/ffj.1571 . [all data]

Agnaniet, Makani, et al., 2005
Agnaniet, H.; Makani, T.; Akagah, A.; Menut, C.; Bessière, J.M., Volatile constituents and antioxidant activity of essential oils from Lippia multiflora Mold. growing in Gabon, Flavour Fragr. J., 2005, 20, 1, 34-38, https://doi.org/10.1002/ffj.1383 . [all data]

Dob, Dahmane, et al., 2005
Dob, T.; Dahmane, D.; Berramdane, T.; Chelghoum, C., Chemical composition of the essential oil of Artemisia campestris L. from Algeria, Pharm. Biol., 2005, 43, 6, 512-514, https://doi.org/10.1080/13880200500220664 . [all data]

Senatore, Napolitano, et al., 2005
Senatore, F.; Napolitano, F.; Arnold, N.A.; Bruno, M.; Herz, W., Composition and antimicrobial activity of the essential oil of Achillea falcata L. (Asteraceae), Flavour Fragr. J., 2005, 20, 3, 291-294, https://doi.org/10.1002/ffj.1411 . [all data]

Ngassapa, Runyoro, et al., 2003
Ngassapa, O.; Runyoro, D.K.B.; Harvala, E.; Chinou, I.B., Composition and antimicrobial activity of essential oils of two populations of Tanzanian Lippia javanica (Burm. f.) Spreng. (Verbenaceae), Flavour Fragr. J., 2003, 18, 3, 221-224, https://doi.org/10.1002/ffj.1195 . [all data]