1,2,4-Trithiolane, 3,5-diethyl-

Van Den Dool and Kratz RI, polar column, temperature ramp

Data compiled by: NIST Mass Spectrometry Data Center, William E. Wallace, director

Column type CapillaryCapillary
Active phase FFAPDB-Wax
Column length (m) 30.30.
Carrier gas HeHe
Substrate
Column diameter (mm) 0.250.25
Phase thickness (μm) 0.250.25
Tstart (C) 40.40.
Tend (C) 220.240.
Heat rate (K/min) 5.6.
Initial hold (min) 3.10.
Final hold (min)  30.
I 1740.1751.
ReferenceCalvo-Gómez, Morales-López, et al., 2004Nielsen, Larsen, et al., 2003
Comment MSDC-RI MSDC-RI

Van Den Dool and Kratz RI, non-polar column, custom temperature program

Data compiled by: NIST Mass Spectrometry Data Center, William E. Wallace, director

Column type Capillary
Active phase SPB-1
Column length (m) 30.
Carrier gas N2
Substrate
Column diameter (mm) 0.32
Phase thickness (μm) 4.0
Program 40 0C (10 min), 2 0C/min to 180 0C, 25 0C/min to 250 0C (5 min)
I 1322.
ReferenceMochizuki, Yamamoto, et al., 1998
Comment MSDC-RI

Van Den Dool and Kratz RI, non-polar column, temperature ramp

Data compiled by: NIST Mass Spectrometry Data Center, William E. Wallace, director

Column type CapillaryCapillaryCapillary
Active phase Ultra-1Ultra-1HP-1
Column length (m) 25.25.50.
Carrier gas H2H2He
Substrate
Column diameter (mm) 0.20.20.32
Phase thickness (μm) 0.330.331.05
Tstart (C) 60.60.40.
Tend (C) 230.230.260.
Heat rate (K/min) 2.2.2.
Initial hold (min)
Final hold (min)
I 1285.81292.91307.
ReferenceFarkas, Hradský, et al., 1992Farkas, Hradský, et al., 1992Kuo and Ho, 1992
Comment MSDC-RI MSDC-RI MSDC-RI

References

Calvo-Gómez, Morales-López, et al., 2004
Calvo-Gómez, O.; Morales-López, J.; López, M.G., Solid-phase microextraction-gas chromatographic-mass spectrometric analysis of garlic oil obtained by hydrodistillation, J. Chromatogr. A, 2004, 1036, 1, 91-93, https://doi.org/10.1016/j.chroma.2004.02.072 . [all data]

Nielsen, Larsen, et al., 2003
Nielsen, G.S.; Larsen, L.M.; Poll, L., Formation of aroma compounds and lipoxygenase (EC 1.13.11.12) activity in unblanced leek (Allium ampeloprasum Var. Bulga) slices during long-term frozen storage, J. Agric. Food Chem., 2003, 51, 7, 1970-1976, https://doi.org/10.1021/jf020921o . [all data]