Beta-caran-3-ol

Condensed phase thermochemistry data

Data compiled by: Hussein Y. Afeefy, Joel F. Liebman, and Stephen E. Stein

Quantity Value Units Method Reference Comment
Δfsolid-82.10 ± 0.59kcal/molCcrKozina, Lukyanova, et al., 1980
Quantity Value Units Method Reference Comment
Δcsolid-1473.26 ± 0.58kcal/molCcrKozina, Lukyanova, et al., 1980Corresponding Δfsolid = -82.09 kcal/mol (simple calculation by NIST; no Washburn corrections)

References

Kozina, Lukyanova, et al., 1980
Kozina, M.P.; Lukyanova, V.A.; Galchenko, G.L.; Deshchits, G.V.; Bardyshev, I.A., Enthalpies of combustion and formation of α- and β-caran-3-ols, Vestsi Akad. Nauk BSSR, Ser. Khim. Nauk, 1980, 31-33. [all data]