5'-Methylthioadenosine, 3TMS derivative

Van Den Dool and Kratz RI, non-polar column, custom temperature program

View large format table.

Column type Active phase I Reference Comment
CapillaryVF-5MS2788.Tretyakov, 201130. m/0.25 mm/0.25 μm, He; Program: Multi-step temperature program; T(initial)=60C; T(final)=270C

Normal alkane RI, non-polar column, custom temperature program

View large format table.

Column type Active phase I Reference Comment
CapillaryMethylsiloxane, 5 % Ph groups2821.Cao, Aa, et al., 2011Program: not specified

References

Tretyakov, 2011
Tretyakov, K.V., Retention Data. NIST Mass Spectrometry Data Center., NIST Mass Spectrometry Data Center, 2011. [all data]

Cao, Aa, et al., 2011
Cao, B.; Aa, J.; Wang, G.; Wu, X.; Liu, L.; Li, M.; Shi, J.; Wang, X.; Zhao, C.; Zheng, T.; Guo, S.; Duan, J., GC-TOFMS analysis of metabolites in adherent MDCK cells and a movel strategy for identifying intracellular metabolic markers for use as cell amount indicators in data normalization, Anal. Bioanal. Chem., 2011, 400, 9, 2983-2993, https://doi.org/10.1007/s00216-011-4981-8 . [all data]