Octanoic acid, 2-phenylethyl ester

Normal alkane RI, non-polar column, temperature ramp

Data compiled by: NIST Mass Spectrometry Data Center, William E. Wallace, director

Column type CapillaryCapillaryCapillaryCapillary
Active phase HP-5 MSBP-1DB-5OV-101
Column length (m) 30.50.25.50.
Carrier gas HeliumHeHeHe
Substrate
Column diameter (mm) 0.320.220.250.22
Phase thickness (μm) 0.250.250.251.
Tstart (C) 50.60.40.100.
Tend (C) 240.220.280.220.
Heat rate (K/min) 4.2.3.1.
Initial hold (min) 2. 5.1.
Final hold (min) 10.20.5.
I 1838.1814.1847.1809.
ReferencePino, Marquez, et al., 2010Boti, Muselli, et al., 2006Merle, Blázquez, et al., 2002Camciuc, Bessière, et al., 1998
Comment MSDC-RI MSDC-RI MSDC-RI MSDC-RI

Van Den Dool and Kratz RI, non-polar column, temperature ramp

Data compiled by: NIST Mass Spectrometry Data Center, William E. Wallace, director

Column type Capillary
Active phase BP-1
Column length (m) 30.
Carrier gas N2
Substrate
Column diameter (mm) 0.32
Phase thickness (μm) 0.25
Tstart (C) 60.
Tend (C) 220.
Heat rate (K/min) 5.
Initial hold (min)
Final hold (min) 13.
I 1820.
ReferenceRaina, Kumar, et al., 2004
Comment MSDC-RI

Kovats' RI, polar column, temperature ramp

Data compiled by: NIST Mass Spectrometry Data Center, William E. Wallace, director

Column type Capillary
Active phase Carbowax 20M
Column length (m) 50.
Carrier gas He
Substrate
Column diameter (mm) 0.28
Phase thickness (μm)
Tstart (C) 70.
Tend (C) 190.
Heat rate (K/min) 2.
Initial hold (min)
Final hold (min)
I 2335.
ReferenceTressl, Friese, et al., 1978
Comment MSDC-RI

References

Pino, Marquez, et al., 2010
Pino, J.A.; Marquez, E.; Quijano, C.E.; Castro, D., Volatile compounds in noni (Morinda citrifolia L.) at two ripening stages, Ciencia e Technologia de Alimentos, 2010, 30, 1, 183-187, https://doi.org/10.1590/S0101-20612010000100028 . [all data]

Boti, Muselli, et al., 2006
Boti, J.B.; Muselli, A.; Tomi, F.; Koukoua, G.; N'Guessan, T.Y.; Costa, J.; Casanova, J., Combined analysis of Cymbopogon giganteus Chiov. leaf oil from Ivory Coast by GC/RI, GC/MS and 13C-NMR, C.R. Chim., 2006, 9, 1, 164-168, https://doi.org/10.1016/j.crci.2005.10.003 . [all data]

Merle, Blázquez, et al., 2002
Merle, H.; Blázquez, M.A.; Boira, H., Chemical composition of the essential oil of Eriobotrya japonica (Thunb.) Lindl. flowers in the western Mediterranean area in International Symposium on Loquat, April 11-13, 2002 (CIHEAM-IAMZ, 2003, p. 191-193), Llácer,G.; Badenes,M.L., ed(s)., Centre International de Hautes Etudes Agronomiques Mediterranean, Valencia, Spain, 2002, 191-193. [all data]

Camciuc, Bessière, et al., 1998
Camciuc, M.; Bessière, J.M.; Vilarem, G.; Gaset, A., Volatile components in okra seed coat, Phytochemistry, 1998, 48, 2, 311-315, https://doi.org/10.1016/S0031-9422(97)01127-8 . [all data]