1,1,1,2,3,3,3,-Heptafluoro-N-(pentafluoroethyl)-N-(trifluoromethyl)-2-propanamine

Phase change data

Data compiled by: William E. Acree, Jr., James S. Chickos

Enthalpy of vaporization

ΔvapH (kJ/mol) Temperature (K) Reference
27.1338.Peterman and Shreeve, 1975

References

Peterman and Shreeve, 1975
Peterman, Keith E.; Shreeve, Jean'ne M., Reactions and photochemistry of some fluorinated amines and imines, Inorg. Chem., 1975, 14, 6, 1223-1228, https://doi.org/10.1021/ic50148a001 . [all data]