Cyclopentanone, 2-methyl-3-(1-methylethyl)-

Normal alkane RI, non-polar column, custom temperature program

View large format table.

Column type Active phase I Reference Comment
CapillaryPolydimethyl siloxanes1174.Zenkevich, 1997Program: not specified

References

Zenkevich, 1997
Zenkevich, I.G., Analytical Parameters of Components of Essential Oils for their Chromatographic and Chromato-Spectral Identificaiton. Oxsigenated derivatives of Mono- and Sesquiterpene Hydrocarbons, Rastit, Resursy (Rus.), 1997, 33, 1, 16-28. [all data]