1-Butanamine, 2-methyl-N-(2-methylbutylidene)-

Normal alkane RI, non-polar column, temperature ramp

Data compiled by: NIST Mass Spectrometry Data Center, William E. Wallace, director

Column type CapillaryCapillaryCapillary
Active phase DB-1DB-1DB-1
Column length (m) 60.60.60.
Carrier gas
Substrate
Column diameter (mm) 0.320.320.32
Phase thickness (μm) 0.250.250.25
Tstart (C) 50.50.50.
Tend (C) 250.250.250.
Heat rate (K/min) 4.4.4.
Initial hold (min)
Final hold (min)
I 1025.1025.1026.
ReferenceFlath, Matsumoto, et al., 1989Flath, Matsumoto, et al., 1989Flath, Matsumoto, et al., 1989
Comment MSDC-RI MSDC-RI MSDC-RI

References

Flath, Matsumoto, et al., 1989
Flath, R.A.; Matsumoto, K.E.; Binder, R.G.; Cunningham, R.T.; Mon, T.R., Effect of pH on the volatiles of hydrolyzed protein insect baits, J. Agric. Food Chem., 1989, 37, 3, 814-819, https://doi.org/10.1021/jf00087a053 . [all data]