Pentanoic acid, heptyl ester

Phase change data

Data compiled by: Thermodynamics Research Center, NIST Boulder Laboratories, Chris Muzny director

Quantity Value Units Method Reference Comment
Tboil518.36KN/ABilterys and Gisseleire, 1935Uncertainty assigned by TRC = 0.3 K
Tboil516.8KN/AGartenmeister, 1886Uncertainty assigned by TRC = 2. K
Quantity Value Units Method Reference Comment
Tfus226.8KN/ABilterys and Gisseleire, 1935Uncertainty assigned by TRC = 0.5 K

In addition to the Thermodynamics Research Center (TRC) data available from this site, much more physical and chemical property data is available from the following TRC products:

References

Bilterys and Gisseleire, 1935
Bilterys, R.; Gisseleire, J., Investigations on the Congelation Temperature of Organic Compounds, Bull. Soc. Chim. Belg., 1935, 44, 567. [all data]

Gartenmeister, 1886
Gartenmeister, R., Investigation of the physical characterstics of liquid compounds: vi boiling point and specific volume of normal fatty acid esters, Justus Liebigs Ann. Chem., 1886, 233, 249-315. [all data]