2-Bromophenyl isobutyl ether

Phase change data

Data compiled by: William E. Acree, Jr., James S. Chickos

Quantity Value Units Method Reference Comment
Δvap15.3 ± 0.05kcal/molGSStrutynska, Sporzynski, et al., 2005Based on data from 293. - 323. K.

References

Strutynska, Sporzynski, et al., 2005
Strutynska, Agata; Sporzynski, Andrzej; Serwatowski, Janusz; Verevkin, Sergey P., Vapour pressures and enthalpies of vaporization of a series of substituted phenyl isobutyl ethers, Fluid Phase Equilibria, 2005, 227, 2, 283-286, https://doi.org/10.1016/j.fluid.2004.11.024 . [all data]