Cyclohexanol, 2-(1,1-dimethylethyl)-, trans-

Reaction thermochemistry data

Data compiled by: Hussein Y. Afeefy, Joel F. Liebman, and Stephen E. Stein

Individual Reactions

Cyclohexanol, 2-(1,1-dimethylethyl)-, trans- = Cyclohexanol, 2-(1,1-dimethylethyl)-, cis-

By formula: C10H20O = C10H20O

Quantity Value Units Method Reference Comment
Δr-3.3 ± 0.42kJ/molCmPasto and Rao, 1970liquid phase; solvent: CCl4

Phase change data

Data compiled by: Thermodynamics Research Center, NIST Boulder Laboratories, Chris Muzny director

Quantity Value Units Method Reference Comment
Tfus357.9KN/AGoering, Reeves, et al., 1956Uncertainty assigned by TRC = 2. K

In addition to the Thermodynamics Research Center (TRC) data available from this site, much more physical and chemical property data is available from the following TRC products:

Kovats' RI, non-polar column, isothermal

View large format table.

Column type Active phase Temperature (C) I Reference Comment
PackedApiezon L130.1211.Paris and Alexandre, 1972Chromosorb W AW

References

Pasto and Rao, 1970
Pasto, D.J.; Rao, D.R., Thermodynamic, conformational, and chemical reactivity studies of the 2,5-di-tert-butylcyclohexyl system. Reversal of the thermodynamic stability with chemical reactivity trends of cyclohexyl derivatives, J. Am. Chem. Soc., 1970, 92, 5151-5160. [all data]