Tantalum,bis(η5-2,4-cyclopentadien-1-yl)dihydro-

Gas phase ion energetics data

Data compiled by: Sharon G. Lias, Rhoda D. Levin, and Sherif A. Kafafi

Ionization energy determinations

IE (eV) Method Reference Comment
8.1 ± 0.1PEGreen, Jackson, et al., 1975Vertical value

References

Green, Jackson, et al., 1975
Green, J.C.; Jackson, S.E.; Higginson, B., Photoelectron studies of some bent bis(n-cyclopentadienyl)metal complexes. Part I. Some eighteen-electron systems with hydride, alkyl, olefin, allyl, carbonyl ligands, J. Chem. Soc. Dalton Trans., 1975, 403. [all data]