1,4-Dibromo-2-methylbutane

Reaction thermochemistry data

Data compiled by: Hussein Y. Afeefy, Joel F. Liebman, and Stephen E. Stein

Individual Reactions

1,4-Dibromo-2-methylbutane = Butane, 1,2-dibromo-3-methyl-

By formula: C5H10Br2 = C5H10Br2

Quantity Value Units Method Reference Comment
Δr-0.60 ± 0.14kcal/molEqkAlenin, Nesterova, et al., 1975gas phase

References

Alenin, Nesterova, et al., 1975
Alenin, V.I.; Nesterova, T.N.; Rozhnov, A.M.; Rasskazova, L.M., Equilibrium of isomerization of dibromoalkanes. V. Isomerization of 3,4-, 2,4-, and 1,4-dibromo-2-methylbutanes, Zh. Fiz. Khim., 1975, 49, 1858. [all data]