1,1-Cyclobutanedicarboxylic acid

Gas phase thermochemistry data

Data compiled by: Hussein Y. Afeefy, Joel F. Liebman, and Stephen E. Stein

Quantity Value Units Method Reference Comment
Δfgas-724.5 ± 1.2kJ/molCcbAl-Takhin, Pilcher, et al., 1983

Condensed phase thermochemistry data

Data compiled by: Hussein Y. Afeefy, Joel F. Liebman, and Stephen E. Stein

Quantity Value Units Method Reference Comment
Δfsolid-835.7 ± 1.0kJ/molCcbAl-Takhin, Pilcher, et al., 1983

References

Al-Takhin, Pilcher, et al., 1983
Al-Takhin, G.; Pilcher, G.; Bickerton, J., Standard enthalpies of formation of diamine(dicarboxylato)platinum(II) complexes and of bis(pentane-2,4-dionato)platinum(II): the mean Pt-O bond dissociation enthalpies, J. Chem. Soc. Dalton Trans., 1983, 2657-2659. [all data]