5-chloro-2,6-dimethylquinoline

Phase change data

Data compiled by: Thermodynamics Research Center, NIST Boulder Laboratories, Chris Muzny director

Quantity Value Units Method Reference Comment
Tfus318.4KN/ABowen, Belfit, et al., 1953Uncertainty assigned by TRC = 2. K

In addition to the Thermodynamics Research Center (TRC) data available from this site, much more physical and chemical property data is available from the following TRC products:

References

Bowen, Belfit, et al., 1953
Bowen, D.M.; Belfit, R.W.; Walser, R.A., The Synthesis and Nitration of 2,6- and 2,7-Dimethylquinoline and of 2,5,8-trimethylquinoline, J. Am. Chem. Soc., 1953, 75, 4307. [all data]