Propanoic acid, 2-bromo-, methyl ester

Kovats' RI, non-polar column, isothermal

View large format table.

Column type Active phase Temperature (C) I Reference Comment
CapillaryOV-101100.838.Horna, Táborský, et al., 1985N2; Column length: 19. m; Column diameter: 0.28 mm
CapillaryOV-10180.836.Komárek, Hornová, et al., 1983Column length: 15. m; Column diameter: 0.22 mm
PackedE-301170.824.Shashkova, Znamenskaia, et al., 1969He, Celite 545 (0.20-0.50 mm); Column length: 2. m

References

Horna, Táborský, et al., 1985
Horna, A.; Táborský, J.; Churácek, J.; Dufka, O., Chromatography of monomers. IV. Gas-liquid chromatographic studies of C1-C6 n-alkyl and C3-C6 isoalkyl acrylates and their hydrogen halide and halogen addition derivatives, J. Chromatogr., 1985, 348, 141-149, https://doi.org/10.1016/S0021-9673(01)92447-1 . [all data]

Komárek, Hornová, et al., 1983
Komárek, K.; Hornová, L.; Horna, A.; Churácek, J., Glass capillary gas chromatography of homologous series of esters. III. Separation of alkyl halogenopropionates and halogenobutyrates on OV-101, J. Chromatogr., 1983, 262, 316-320, https://doi.org/10.1016/S0021-9673(01)88112-7 . [all data]

Shashkova, Znamenskaia, et al., 1969
Shashkova, A.A.; Znamenskaia, A.P.; Pas'ko, L.Ya., Investigation of esters of odd series halohenated acids with Kovats indices, Gazovaya Khromatografiya, 1969, 9, 40-47. [all data]