CAS Reg. No. 54448-39-4

Reaction thermochemistry data

Data compiled by: John E. Bartmess

Individual Reactions

(CAS Reg. No. 54448-39-4 • 4294967295Methanimine) + Methanimine = CAS Reg. No. 54448-39-4

By formula: (CAS Reg. No. 54448-39-4 • 4294967295CH3N) + CH3N = CAS Reg. No. 54448-39-4

Quantity Value Units Method Reference Comment
Δr23.7 ± 4.1kcal/molN/AMacKay, Hemsworth, et al., 1976gas phase

References

MacKay, Hemsworth, et al., 1976
MacKay, G.J.; Hemsworth, R.S.; Bohme, D.K., Absolute gas-phase acidities of CH3NH2, C2H5NH2, (CH3)2NH, and (CH3)3N, Can. J. Chem., 1976, 54, 1624. [all data]