Diisoamyl ether

Kovats' RI, non-polar column, isothermal

Data compiled by: NIST Mass Spectrometry Data Center, William E. Wallace, director

Column type PackedPackedPackedPacked
Active phase SE-30Apiezon LApiezon LApiezon M
Column length (m) 3.  2.1
Carrier gas N2  N2
Substrate SupelcoportCelite 545Celite 545Chromosorb W
Column diameter (mm)
Phase thickness (μm)
Temperature (C) 120.120.160.130.
I 1002.980.988.987.
ReferenceGarcía-Raso, Martínez-Castro, et al., 1987Bogoslovsky, Anvaer, et al., 1978Bogoslovsky, Anvaer, et al., 1978Golovnya and Garbuzov, 1974
Comment MSDC-RI MSDC-RI MSDC-RI MSDC-RI

Phase change data

Data compiled as indicated in comments:
BS - Robert L. Brown and Stephen E. Stein
TRC - Thermodynamics Research Center, NIST Boulder Laboratories, Chris Muzny director
AC - William E. Acree, Jr., James S. Chickos

Quantity Value Units Method Reference Comment
Tboil445.7KN/AWeast and Grasselli, 1989BS
Tboil446.4KN/ALecat, 1947Uncertainty assigned by TRC = 0.5 K; TRC
Tboil446.5KN/ALecat, 1943Uncertainty assigned by TRC = 0.35 K; TRC
Tboil444.KN/AHurd, Parrish, et al., 1933Uncertainty assigned by TRC = 4. K; TRC
Tboil445.8KN/ALecat, 1927Uncertainty assigned by TRC = 0.5 K; TRC
Quantity Value Units Method Reference Comment
Δvap11.94kcal/molN/AMajer and Svoboda, 1985
Δvap12.3kcal/molCGCChickos, Hosseini, et al., 1995Based on data from 353. - 393. K.; AC

Reduced pressure boiling point

Tboil (K) Pressure (atm) Reference Comment
333.20.013Weast and Grasselli, 1989BS

Enthalpy of vaporization

ΔvapH (kcal/mol) Temperature (K) Method Reference Comment
11.4306.AStephenson and Malanowski, 1987Based on data from 291. - 447. K. See also Stull, 1947.; AC
9.89443.N/ALapidus and Nisel'son, 1968Based on data from 417. - 470. K.; AC

Antoine Equation Parameters

log10(P) = A − (B / (T + C))
    P = vapor pressure (atm)
    T = temperature (K)

View plot Requires a JavaScript / HTML 5 canvas capable browser.

Temperature (K) A B C Reference Comment
291.8 - 446.64.730881935.574-37.417Stull, 1947Coefficents calculated by NIST from author's data.

In addition to the Thermodynamics Research Center (TRC) data available from this site, much more physical and chemical property data is available from the following TRC products:

Kovats' RI, polar column, isothermal

View large format table.

Column type Active phase Temperature (C) I Reference Comment
CapillaryCarbowax 20M120.1063.García-Raso, Martínez-Castro, et al., 1987N2, Supelcoport; Column length: 25. m; Column diameter: 0.22 mm

Normal alkane RI, non-polar column, custom temperature program

View large format table.

Column type Active phase I Reference Comment
CapillarySqualane1002.Chen, 2008Program: not specified
CapillarySE-301000.Vinogradov, 2004Program: not specified
CapillarySE-30999.Vinogradov, 2004Program: not specified
CapillaryOV-1011000.Zenkevich and Malamakhov, 1987He; Column length: 50. m; Column diameter: 0.24 mm; Program: not specified
CapillaryOV-1011000.Zenkevich and Malamakhov, 1987He; Column length: 50. m; Column diameter: 0.24 mm; Program: not specified

Normal alkane RI, polar column, custom temperature program

View large format table.

Column type Active phase I Reference Comment
CapillaryCarbowax 20M1064.Vinogradov, 2004Program: not specified
CapillaryCarbowax 20M1067.Vinogradov, 2004Program: not specified

References

García-Raso, Martínez-Castro, et al., 1987
García-Raso, A.; Martínez-Castro, I.; Páez, M.I.; Sanz, J.; García-Raso, J.; Saura-Calixto, F., Gas Chromatographic Behaviour of Carbohydrate Trimethylsilyl Ethers. I. Aldopentoses, J. Chromatogr., 1987, 398, 9-20, https://doi.org/10.1016/S0021-9673(01)96491-X . [all data]

Bogoslovsky, Anvaer, et al., 1978
Bogoslovsky, Yu.N.; Anvaer, B.I.; Vigdergauz, M.S., Chromatographic constants in gas chromatography (in Russian), Standards Publ. House, Moscow, 1978, 192. [all data]

Golovnya and Garbuzov, 1974
Golovnya, R.V.; Garbuzov, V.G., Effect of heteroatom in aliphatic sulfur- and oxygen-containing compounds on the values of the retention indices in gas chromatography, Izv. Akad. Nauk SSSR Ser. Khim., 1974, 7, 1519-1521. [all data]