CSeF2

Gas phase ion energetics data

Data compiled as indicated in comments:
LBLHLM - Sharon G. Lias, John E. Bartmess, Joel F. Liebman, John L. Holmes, Rhoda D. Levin, and W. Gary Mallard

Ionization energy determinations

IE (eV) Method Reference Comment
9.4EIBinnewies, Grosse, et al., 1985LBLHLM
9.8PEBock, Aygen, et al., 1984LBLHLM

References

Binnewies, Grosse, et al., 1985
Binnewies, M.; Grosse, J.; Le Van, D., Reaktive E=C(p-p)π-systeme II: Massenspektrometrische untersuchun von F3CP=CF2, F3CAs=CF2, S=CF2 und Se=CF2, Phosphorus Sulfur, 1985, 21, 349. [all data]

Bock, Aygen, et al., 1984
Bock, H.; Aygen, S.; Rosmus, P.; Solouki, B.; Weissflog, E., Gasphasen-reaktionen,40. Selenoformaldehyd: Hochkorrelierte wellenfunktion und photoelektronenspektroskopischer nachweis, Chem. Ber., 1984, 117, 187. [all data]